BDBM50307411 3-[2-({[3-Methyl-1-(3-methylphenyl)butyl]amino}carbonyl)-4-(phenoxymethyl)phenyl]propanoic acid::CHEMBL598796
SMILES: CC(C)CC(NC(=O)c1cc(COc2ccccc2)ccc1CCC(O)=O)c1cccc(C)c1
InChI Key: InChIKey=KOSVUBTZPMOYMW-UHFFFAOYSA-N
Data: 1 KI  1 IC50
Activity Spreadsheet -- Enzyme Inhibition Constant Data from BindingDB
Found 2 hits for monomerid = 50307411
Trg + Lig
Ki
nM
ΔG°
kcal/mole
IC50
nM
Kd
nM
EC50/IC50
nM
koff
s-1
kon
M-1s-1
pHTemp
°C
Prostanoid EP3 Receptor
(Mus musculus (Mouse))
BDBM50307411
(3-[2-({[3-Methyl-1-(3-methylphenyl)butyl]amino}car...)
Show SMILES CC(C)CC(NC(=O)c1cc(COc2ccccc2)ccc1CCC(O)=O)c1cccc(C)c1
Show InChI InChI=1S/C29H33NO4/c1-20(2)16-27(24-9-7-8-21(3)17-24)30-29(33)26-18-22(12-13-23(26)14-15-28(31)32)19-34-25-10-5-4-6-11-25/h4-13,17-18,20,27H,14-16,19H2,1-3H3,(H,30,33)(H,31,32)
0.300n/an/an/an/an/an/an/an/a
Minase Research Institute
Curated by ChEMBL
Assay Description
Displacement of [3H]PGE2 from mouse EP3 receptor expressed in CHO cell membrane
Bioorg Med Chem 18: 1641-58 (2010)
Article DOI: 10.1016/j.bmc.2009.12.068
BindingDB Entry DOI: 10.7270/Q29023W2
Prostanoid EP3 Receptor
(Mus musculus (Mouse))
BDBM50307411
(3-[2-({[3-Methyl-1-(3-methylphenyl)butyl]amino}car...)
Show SMILES CC(C)CC(NC(=O)c1cc(COc2ccccc2)ccc1CCC(O)=O)c1cccc(C)c1
Show InChI InChI=1S/C29H33NO4/c1-20(2)16-27(24-9-7-8-21(3)17-24)30-29(33)26-18-22(12-13-23(26)14-15-28(31)32)19-34-25-10-5-4-6-11-25/h4-13,17-18,20,27H,14-16,19H2,1-3H3,(H,30,33)(H,31,32)
n/an/a 37n/an/an/an/an/an/a
Minase Research Institute
Curated by ChEMBL
Assay Description
Antagonist activity at mouse EP3 receptor expressed in CHO cells assessed as inhibition of PGE2-induced increase intracellular calcium level in prese...
Bioorg Med Chem 18: 1641-58 (2010)
Article DOI: 10.1016/j.bmc.2009.12.068
BindingDB Entry DOI: 10.7270/Q29023W2