BDBM50307423 3-[2-({[1-(3,4-Dimethylphenyl)-3-methylbutyl]amino}-carbonyl)-4-(phenoxymethyl)phenyl]propanoic acid::CHEMBL598410
SMILES: CC(C)CC(NC(=O)c1cc(COc2ccccc2)ccc1CCC(O)=O)c1ccc(C)c(C)c1
InChI Key: InChIKey=QPNYAFGLQDXISG-UHFFFAOYSA-N
Data: 1 KI  1 IC50
Activity Spreadsheet -- Enzyme Inhibition Constant Data from BindingDB
Found 2 hits for monomerid = 50307423
Trg + Lig
Ki
nM
ΔG°
kcal/mole
IC50
nM
Kd
nM
EC50/IC50
nM
koff
s-1
kon
M-1s-1
pHTemp
°C
Prostaglandin E2 receptor EP3 subtype
(Mus musculus (Mouse))
BDBM50307423
(3-[2-({[1-(3,4-Dimethylphenyl)-3-methylbutyl]amino...)
Show SMILES CC(C)CC(NC(=O)c1cc(COc2ccccc2)ccc1CCC(O)=O)c1ccc(C)c(C)c1
Show InChI InChI=1S/C30H35NO4/c1-20(2)16-28(25-12-10-21(3)22(4)17-25)31-30(34)27-18-23(11-13-24(27)14-15-29(32)33)19-35-26-8-6-5-7-9-26/h5-13,17-18,20,28H,14-16,19H2,1-4H3,(H,31,34)(H,32,33)
0.170n/an/an/an/an/an/an/an/a
Minase Research Institute
Curated by ChEMBL
Assay Description
Displacement of [3H]PGE2 from mouse EP3 receptor expressed in CHO cell membrane
Bioorg Med Chem 18: 1641-58 (2010)
Article DOI: 10.1016/j.bmc.2009.12.068
BindingDB Entry DOI: 10.7270/Q29023W2
Prostaglandin E2 receptor EP3 subtype
(Mus musculus (Mouse))
BDBM50307423
(3-[2-({[1-(3,4-Dimethylphenyl)-3-methylbutyl]amino...)
Show SMILES CC(C)CC(NC(=O)c1cc(COc2ccccc2)ccc1CCC(O)=O)c1ccc(C)c(C)c1
Show InChI InChI=1S/C30H35NO4/c1-20(2)16-28(25-12-10-21(3)22(4)17-25)31-30(34)27-18-23(11-13-24(27)14-15-29(32)33)19-35-26-8-6-5-7-9-26/h5-13,17-18,20,28H,14-16,19H2,1-4H3,(H,31,34)(H,32,33)
n/an/a 16n/an/an/an/an/an/a
Minase Research Institute
Curated by ChEMBL
Assay Description
Antagonist activity at mouse EP3 receptor expressed in CHO cells assessed as inhibition of PGE2-induced increase intracellular calcium level in prese...
Bioorg Med Chem 18: 1641-58 (2010)
Article DOI: 10.1016/j.bmc.2009.12.068
BindingDB Entry DOI: 10.7270/Q29023W2