BDBM50307430 3-[2-[({1-[3-Fluoro-4-(trifluoromethyl)phenyl]-3-methylbutyl}amino)carbonyl]-4-(phenoxymethyl)phenyl]propanoic acid::CHEMBL599420
SMILES: CC(C)CC(NC(=O)c1cc(COc2ccccc2)ccc1CCC(O)=O)c1ccc(c(F)c1)C(F)(F)F
InChI Key: InChIKey=WIRJDSFCSUNLAH-UHFFFAOYSA-N
Data: 1 KI  1 IC50
Activity Spreadsheet -- Enzyme Inhibition Constant Data from BindingDB
Found 2 hits for monomerid = 50307430
Trg + Lig
Ki
nM
ΔG°
kcal/mole
IC50
nM
Kd
nM
EC50/IC50
nM
koff
s-1
kon
M-1s-1
pHTemp
°C
Prostanoid EP3 Receptor
(Mus musculus (Mouse))
BDBM50307430
(3-[2-[({1-[3-Fluoro-4-(trifluoromethyl)phenyl]-3-m...)
Show SMILES CC(C)CC(NC(=O)c1cc(COc2ccccc2)ccc1CCC(O)=O)c1ccc(c(F)c1)C(F)(F)F
Show InChI InChI=1S/C29H29F4NO4/c1-18(2)14-26(21-10-12-24(25(30)16-21)29(31,32)33)34-28(37)23-15-19(8-9-20(23)11-13-27(35)36)17-38-22-6-4-3-5-7-22/h3-10,12,15-16,18,26H,11,13-14,17H2,1-2H3,(H,34,37)(H,35,36)
0.700n/an/an/an/an/an/an/an/a
Minase Research Institute
Curated by ChEMBL
Assay Description
Displacement of [3H]PGE2 from mouse EP3 receptor expressed in CHO cell membrane
Bioorg Med Chem 18: 1641-58 (2010)
Article DOI: 10.1016/j.bmc.2009.12.068
BindingDB Entry DOI: 10.7270/Q29023W2
Prostanoid EP3 Receptor
(Mus musculus (Mouse))
BDBM50307430
(3-[2-[({1-[3-Fluoro-4-(trifluoromethyl)phenyl]-3-m...)
Show SMILES CC(C)CC(NC(=O)c1cc(COc2ccccc2)ccc1CCC(O)=O)c1ccc(c(F)c1)C(F)(F)F
Show InChI InChI=1S/C29H29F4NO4/c1-18(2)14-26(21-10-12-24(25(30)16-21)29(31,32)33)34-28(37)23-15-19(8-9-20(23)11-13-27(35)36)17-38-22-6-4-3-5-7-22/h3-10,12,15-16,18,26H,11,13-14,17H2,1-2H3,(H,34,37)(H,35,36)
n/an/a 53n/an/an/an/an/an/a
Minase Research Institute
Curated by ChEMBL
Assay Description
Antagonist activity at mouse EP3 receptor expressed in CHO cells assessed as inhibition of PGE2-induced increase intracellular calcium level in prese...
Bioorg Med Chem 18: 1641-58 (2010)
Article DOI: 10.1016/j.bmc.2009.12.068
BindingDB Entry DOI: 10.7270/Q29023W2