null
SMILES: CC(C)CC(NC(=O)c1cc(COc2ccccc2F)ccc1CCC(O)=O)c1cc(C)cc(C)c1
InChI Key: InChIKey=GZDWUKOMCIOVJR-UHFFFAOYSA-N
Activity Spreadsheet -- Enzyme Inhibition Constant Data from BindingDB
Found 2 hits for monomerid = 50307434
Trg + Lig
Ki
nM
ΔG°
kcal/mole
IC50
nM
Kd
nM
EC50/IC50
nM
koff
s-1
kon
M-1s-1
pHTemp
°C
Prostaglandin E2 receptor EP3 subtype
(Mus musculus (Mouse))
BDBM50307434
(3-{2-({[1-(3,5-Dimethylphenyl)-3-methylbutyl]amino...)
Show SMILES CC(C)CC(NC(=O)c1cc(COc2ccccc2F)ccc1CCC(O)=O)c1cc(C)cc(C)c1
Show InChI InChI=1S/C30H34FNO4/c1-19(2)13-27(24-15-20(3)14-21(4)16-24)32-30(35)25-17-22(9-10-23(25)11-12-29(33)34)18-36-28-8-6-5-7-26(28)31/h5-10,14-17,19,27H,11-13,18H2,1-4H3,(H,32,35)(H,33,34)
0.100n/an/an/an/an/an/an/an/a
Minase Research Institute
Curated by ChEMBL
Assay Description
Displacement of [3H]PGE2 from mouse EP3 receptor expressed in CHO cell membrane
Bioorg Med Chem 18: 1641-58 (2010)
Article DOI: 10.1016/j.bmc.2009.12.068
BindingDB Entry DOI: 10.7270/Q29023W2
Prostaglandin E2 receptor EP3 subtype
(Mus musculus (Mouse))
BDBM50307434
(3-{2-({[1-(3,5-Dimethylphenyl)-3-methylbutyl]amino...)
Show SMILES CC(C)CC(NC(=O)c1cc(COc2ccccc2F)ccc1CCC(O)=O)c1cc(C)cc(C)c1
Show InChI InChI=1S/C30H34FNO4/c1-19(2)13-27(24-15-20(3)14-21(4)16-24)32-30(35)25-17-22(9-10-23(25)11-12-29(33)34)18-36-28-8-6-5-7-26(28)31/h5-10,14-17,19,27H,11-13,18H2,1-4H3,(H,32,35)(H,33,34)
n/an/a 13n/an/an/an/an/an/a
Minase Research Institute
Curated by ChEMBL
Assay Description
Antagonist activity at mouse EP3 receptor expressed in CHO cells assessed as inhibition of PGE2-induced increase intracellular calcium level in prese...
Bioorg Med Chem 18: 1641-58 (2010)
Article DOI: 10.1016/j.bmc.2009.12.068
BindingDB Entry DOI: 10.7270/Q29023W2