BDBM50307476 (1S,2R)-1-(3,3-Dimethyl-2,3-dihydro-1H-indol-1-yl)-3-(methylamino)-1-phenylpropan-2-ol Hydrochloride::CHEMBL600220
SMILES: CNC[C@@H](O)[C@@H](N1CC(C)(C)c2ccccc12)c1ccccc1
InChI Key: InChIKey=JPKPMAFVTNGLLQ-MOPGFXCFSA-N
Data: 2 IC50
Activity Spreadsheet -- Enzyme Inhibition Constant Data from BindingDB
Found 2 hits for monomerid = 50307476
Trg + Lig
Ki
nM
ΔG°
kcal/mole
IC50
nM
Kd
nM
EC50/IC50
nM
koff
s-1
kon
M-1s-1
pHTemp
°C
Sodium-dependent serotonin transporter
(Homo sapiens (Human))
BDBM50307476
((1S,2R)-1-(3,3-Dimethyl-2,3-dihydro-1H-indol-1-yl)...)
Show SMILES CNC[C@@H](O)[C@@H](N1CC(C)(C)c2ccccc12)c1ccccc1 |r|
Show InChI InChI=1S/C20H26N2O/c1-20(2)14-22(17-12-8-7-11-16(17)20)19(18(23)13-21-3)15-9-5-4-6-10-15/h4-12,18-19,21,23H,13-14H2,1-3H3/t18-,19+/m1/s1
n/an/a 2.87E+3n/an/an/an/an/an/a
Wyeth Research
Curated by ChEMBL
Assay Description
Inhibition of serotonin uptake at human SERT expressed in human JAR cells
J Med Chem 53: 2051-62 (2010)
Article DOI: 10.1021/jm901559e
BindingDB Entry DOI: 10.7270/Q21J99VS
Sodium-dependent noradrenaline transporter
(Homo sapiens (Human))
BDBM50307476
((1S,2R)-1-(3,3-Dimethyl-2,3-dihydro-1H-indol-1-yl)...)
Show SMILES CNC[C@@H](O)[C@@H](N1CC(C)(C)c2ccccc12)c1ccccc1 |r|
Show InChI InChI=1S/C20H26N2O/c1-20(2)14-22(17-12-8-7-11-16(17)20)19(18(23)13-21-3)15-9-5-4-6-10-15/h4-12,18-19,21,23H,13-14H2,1-3H3/t18-,19+/m1/s1
Reactome pathway
n/an/a 5.70n/an/an/an/an/an/a
Wyeth Research
Curated by ChEMBL
Assay Description
Inhibition of norepinephrine uptake at human NET expressed in MDCK-Net6 cells
J Med Chem 53: 2051-62 (2010)
Article DOI: 10.1021/jm901559e
BindingDB Entry DOI: 10.7270/Q21J99VS