BDBM50307528 8-(Cyclopentylamino)-1-(pyridin-2-yl)-4,5-dihydro-1H-pyrazolo[4,3-h]quinazoline-3-carboxamide::CHEMBL597977
SMILES: NC(=O)c1nn(c-2c1CCc1cnc(NC3CCCC3)nc-21)-c1ccccn1
InChI Key: InChIKey=GYMVEDSUJRTLGP-UHFFFAOYSA-N
Data: 2 IC50
Activity Spreadsheet -- Enzyme Inhibition Constant Data from BindingDB
Found 2 hits for monomerid = 50307528
Trg + Lig
Ki
nM
ΔG°
kcal/mole
IC50
nM
Kd
nM
EC50/IC50
nM
koff
s-1
kon
M-1s-1
pHTemp
°C
Aurora kinase A
(Homo sapiens (Human))
BDBM50307528
(8-(Cyclopentylamino)-1-(pyridin-2-yl)-4,5-dihydro-...)
Show SMILES NC(=O)c1nn(c-2c1CCc1cnc(NC3CCCC3)nc-21)-c1ccccn1
Show InChI InChI=1S/C20H21N7O/c21-19(28)17-14-9-8-12-11-23-20(24-13-5-1-2-6-13)25-16(12)18(14)27(26-17)15-7-3-4-10-22-15/h3-4,7,10-11,13H,1-2,5-6,8-9H2,(H2,21,28)(H,23,24,25)
NCI pathway
Reactome pathway
n/an/a>1.00E+4n/an/an/an/an/an/a
Nerviano Medical Sciences Srl
Curated by ChEMBL
Assay Description
Inhibition of Aurora A
J Med Chem 53: 2171-87 (2010)
Article DOI: 10.1021/jm901710h
BindingDB Entry DOI: 10.7270/Q2N879W9
CDK2/Cyclin A/Cyclin A1
(Homo sapiens (Human))
BDBM50307528
(8-(Cyclopentylamino)-1-(pyridin-2-yl)-4,5-dihydro-...)
Show SMILES NC(=O)c1nn(c-2c1CCc1cnc(NC3CCCC3)nc-21)-c1ccccn1
Show InChI InChI=1S/C20H21N7O/c21-19(28)17-14-9-8-12-11-23-20(24-13-5-1-2-6-13)25-16(12)18(14)27(26-17)15-7-3-4-10-22-15/h3-4,7,10-11,13H,1-2,5-6,8-9H2,(H2,21,28)(H,23,24,25)
Reactome pathway
n/an/a 52n/an/an/an/an/an/a
Nerviano Medical Sciences Srl
Curated by ChEMBL
Assay Description
Inhibition of CDK2/Cyclin A
J Med Chem 53: 2171-87 (2010)
Article DOI: 10.1021/jm901710h
BindingDB Entry DOI: 10.7270/Q2N879W9