BDBM50307536 8-[(1-Acetylpiperidin-4-yl)amino]-N,1-dimethyl-4,5-dihydro-1Hpyrazolo[4,3-h]quinazoline-3-carboxamide::CHEMBL599427
SMILES: CNC(=O)c1nn(C)c-2c1CCc1cnc(NC3CCN(CC3)C(C)=O)nc-21
InChI Key: InChIKey=AOJLBKYLAVRMQT-UHFFFAOYSA-N
Data: 2 IC50
Activity Spreadsheet -- Enzyme Inhibition Constant Data from BindingDB
Found 2 hits for monomerid = 50307536
Trg + Lig
Ki
nM
ΔG°
kcal/mole
IC50
nM
Kd
nM
EC50/IC50
nM
koff
s-1
kon
M-1s-1
pHTemp
°C
Aurora kinase A
(Homo sapiens (Human))
BDBM50307536
(8-[(1-Acetylpiperidin-4-yl)amino]-N,1-dimethyl-4,5...)
Show SMILES CNC(=O)c1nn(C)c-2c1CCc1cnc(NC3CCN(CC3)C(C)=O)nc-21
Show InChI InChI=1S/C19H25N7O2/c1-11(27)26-8-6-13(7-9-26)22-19-21-10-12-4-5-14-16(18(28)20-2)24-25(3)17(14)15(12)23-19/h10,13H,4-9H2,1-3H3,(H,20,28)(H,21,22,23)
NCI pathway
Reactome pathway
n/an/a>1.00E+4n/an/an/an/an/an/a
Nerviano Medical Sciences Srl
Curated by ChEMBL
Assay Description
Inhibition of Aurora A
J Med Chem 53: 2171-87 (2010)
Article DOI: 10.1021/jm901710h
BindingDB Entry DOI: 10.7270/Q2N879W9
CDK2/Cyclin A/Cyclin A1
(Homo sapiens (Human))
BDBM50307536
(8-[(1-Acetylpiperidin-4-yl)amino]-N,1-dimethyl-4,5...)
Show SMILES CNC(=O)c1nn(C)c-2c1CCc1cnc(NC3CCN(CC3)C(C)=O)nc-21
Show InChI InChI=1S/C19H25N7O2/c1-11(27)26-8-6-13(7-9-26)22-19-21-10-12-4-5-14-16(18(28)20-2)24-25(3)17(14)15(12)23-19/h10,13H,4-9H2,1-3H3,(H,20,28)(H,21,22,23)
Reactome pathway
n/an/a 32n/an/an/an/an/an/a
Nerviano Medical Sciences Srl
Curated by ChEMBL
Assay Description
Inhibition of CDK2/Cyclin A
J Med Chem 53: 2171-87 (2010)
Article DOI: 10.1021/jm901710h
BindingDB Entry DOI: 10.7270/Q2N879W9