BDBM50307955 4-(2,4-Dichlorobenzyl)-1-(7H-pyrrolo[2,3-d]pyrimidin-4-yl)piperidin-4-amine::CHEMBL597414::US8796293, 59
SMILES: NC1(Cc2ccc(Cl)cc2Cl)CCN(CC1)c1ncnc2[nH]ccc12
InChI Key: InChIKey=IHFNPMSBZFZRSQ-UHFFFAOYSA-N
Data: 3 IC50
Activity Spreadsheet -- Enzyme Inhibition Constant Data from BindingDB
Found 3 hits for monomerid = 50307955
Trg + Lig
Ki
nM
ΔG°
kcal/mole
IC50
nM
Kd
nM
EC50/IC50
nM
koff
s-1
kon
M-1s-1
pHTemp
°C
Rho-associated protein kinase 2
(Homo sapiens (Human))
BDBM50307955
(4-(2,4-Dichlorobenzyl)-1-(7H-pyrrolo[2,3-d]pyrimid...)
Show SMILES NC1(Cc2ccc(Cl)cc2Cl)CCN(CC1)c1ncnc2[nH]ccc12
Show InChI InChI=1S/C18H19Cl2N5/c19-13-2-1-12(15(20)9-13)10-18(21)4-7-25(8-5-18)17-14-3-6-22-16(14)23-11-24-17/h1-3,6,9,11H,4-5,7-8,10,21H2,(H,22,23,24)
US Patent
n/an/a<30n/an/an/an/a7.525
Astex Therapeutics Limited; The Institute of Cancer Research: Royal Cancer Hospital; Cancer Research Technology Limited
US Patent
Assay Description
In a final reaction volume of 25 ul, ROCK-II (h) (5-10 mU) is incubated with 50 mM Tris pH 7.5, 0.1 mM EGTA, 30 uM KEAKEKRQEQIAKRRRLSSLRASTSKSGGSQK (...
US Patent US8796293 (2014)
BindingDB Entry DOI: 10.7270/Q21C1VJM
Serine/threonine-protein kinase AKT2
(Homo sapiens (Human))
BDBM50307955
(4-(2,4-Dichlorobenzyl)-1-(7H-pyrrolo[2,3-d]pyrimid...)
Show SMILES NC1(Cc2ccc(Cl)cc2Cl)CCN(CC1)c1ncnc2[nH]ccc12
Show InChI InChI=1S/C18H19Cl2N5/c19-13-2-1-12(15(20)9-13)10-18(21)4-7-25(8-5-18)17-14-3-6-22-16(14)23-11-24-17/h1-3,6,9,11H,4-5,7-8,10,21H2,(H,22,23,24)
n/an/a 8.5n/an/an/an/an/an/a
Institute of Cancer Research
Curated by ChEMBL
Assay Description
Inhibition of PKBbeta by radiometric filter binding assay
J Med Chem 53: 2239-49 (2010)
Article DOI: 10.1021/jm901788j
BindingDB Entry DOI: 10.7270/Q23B608V
RAC-alpha serine/threonine-protein kinase
(Homo sapiens (Human))
BDBM50307955
(4-(2,4-Dichlorobenzyl)-1-(7H-pyrrolo[2,3-d]pyrimid...)
Show SMILES NC1(Cc2ccc(Cl)cc2Cl)CCN(CC1)c1ncnc2[nH]ccc12
Show InChI InChI=1S/C18H19Cl2N5/c19-13-2-1-12(15(20)9-13)10-18(21)4-7-25(8-5-18)17-14-3-6-22-16(14)23-11-24-17/h1-3,6,9,11H,4-5,7-8,10,21H2,(H,22,23,24)
n/an/a 1.90n/an/an/an/an/an/a
Institute of Cancer Research
Curated by ChEMBL
Assay Description
Inhibition of PKB in human PC3M cells assessed as GSK3beta phosphorylation by ELISA
J Med Chem 53: 2239-49 (2010)
Article DOI: 10.1021/jm901788j
BindingDB Entry DOI: 10.7270/Q23B608V