BDBM50307960 4-Amino-N-(3,4-dichlorobenzyl)-1-(7H-pyrrolo[2,3-d]pyrimidin-4-yl)piperidine-4-carboxamide::CHEMBL598206
SMILES: NC1(CCN(CC1)c1ncnc2[nH]ccc12)C(=O)NCc1ccc(Cl)c(Cl)c1
InChI Key: InChIKey=NFAREZHQAIPMEN-UHFFFAOYSA-N
Data: 1 IC50
Activity Spreadsheet -- Enzyme Inhibition Constant Data from BindingDB
Found 1 hit for monomerid = 50307960
Trg + Lig
Ki
nM
ΔG°
kcal/mole
IC50
nM
Kd
nM
EC50/IC50
nM
koff
s-1
kon
M-1s-1
pHTemp
°C
RAC-beta serine/threonine-protein kinase
(Homo sapiens (Human))
BDBM50307960
(4-Amino-N-(3,4-dichlorobenzyl)-1-(7H-pyrrolo[2,3-d...)
Show SMILES NC1(CCN(CC1)c1ncnc2[nH]ccc12)C(=O)NCc1ccc(Cl)c(Cl)c1
Show InChI InChI=1S/C19H20Cl2N6O/c20-14-2-1-12(9-15(14)21)10-24-18(28)19(22)4-7-27(8-5-19)17-13-3-6-23-16(13)25-11-26-17/h1-3,6,9,11H,4-5,7-8,10,22H2,(H,24,28)(H,23,25,26)
n/an/a 5.70n/an/an/an/an/an/a
Institute of Cancer Research
Curated by ChEMBL
Assay Description
Inhibition of PKBbeta by radiometric filter binding assay
J Med Chem 53: 2239-49 (2010)
Article DOI: 10.1021/jm901788j
BindingDB Entry DOI: 10.7270/Q23B608V