BDBM50307964 4-Amino-1-(7H-pyrrolo[2,3-d]pyrimidin-4-yl)-N-(4-(trifluoromethyl)-benzyl)-piperidine-4-carboxamide::CHEMBL599847
SMILES: NC1(CCN(CC1)c1ncnc2[nH]ccc12)C(=O)NCc1ccc(cc1)C(F)(F)F
InChI Key: InChIKey=FUXUDBYFXDFVBL-UHFFFAOYSA-N
Data: 1 IC50
Activity Spreadsheet -- Enzyme Inhibition Constant Data from BindingDB
Found 1 hit for monomerid = 50307964
Trg + Lig
Ki
nM
ΔG°
kcal/mole
IC50
nM
Kd
nM
EC50/IC50
nM
koff
s-1
kon
M-1s-1
pHTemp
°C
RAC-beta serine/threonine-protein kinase
(Homo sapiens (Human))
BDBM50307964
(4-Amino-1-(7H-pyrrolo[2,3-d]pyrimidin-4-yl)-N-(4-(...)
Show SMILES NC1(CCN(CC1)c1ncnc2[nH]ccc12)C(=O)NCc1ccc(cc1)C(F)(F)F
Show InChI InChI=1S/C20H21F3N6O/c21-20(22,23)14-3-1-13(2-4-14)11-26-18(30)19(24)6-9-29(10-7-19)17-15-5-8-25-16(15)27-12-28-17/h1-5,8,12H,6-7,9-11,24H2,(H,26,30)(H,25,27,28)
n/an/a 11n/an/an/an/an/an/a
Institute of Cancer Research
Curated by ChEMBL
Assay Description
Inhibition of PKBbeta by radiometric filter binding assay
J Med Chem 53: 2239-49 (2010)
Article DOI: 10.1021/jm901788j
BindingDB Entry DOI: 10.7270/Q23B608V