BDBM50307967 4-(4-Chlorobenzyl)-1-(1H-pyrazolo[3,4-b]pyridin-4-yl)-piperidin-4-ylamine::CHEMBL598013
SMILES: NC1(Cc2ccc(Cl)cc2)CCN(CC1)c1ccnc2[nH]ncc12
InChI Key: InChIKey=ZFVMFXQNRBEZFM-UHFFFAOYSA-N
Data: 1 IC50
Activity Spreadsheet -- Enzyme Inhibition Constant Data from BindingDB
Found 1 hit for monomerid = 50307967
Trg + Lig
Ki
nM
ΔG°
kcal/mole
IC50
nM
Kd
nM
EC50/IC50
nM
koff
s-1
kon
M-1s-1
pHTemp
°C
Serine/threonine-protein kinase AKT2
(Homo sapiens (Human))
BDBM50307967
(4-(4-Chlorobenzyl)-1-(1H-pyrazolo[3,4-b]pyridin-4-...)
Show SMILES NC1(Cc2ccc(Cl)cc2)CCN(CC1)c1ccnc2[nH]ncc12
Show InChI InChI=1S/C18H20ClN5/c19-14-3-1-13(2-4-14)11-18(20)6-9-24(10-7-18)16-5-8-21-17-15(16)12-22-23-17/h1-5,8,12H,6-7,9-11,20H2,(H,21,22,23)
n/an/a 12n/an/an/an/an/an/a
Institute of Cancer Research
Curated by ChEMBL
Assay Description
Inhibition of PKBbeta by radiometric filter binding assay
J Med Chem 53: 2239-49 (2010)
Article DOI: 10.1021/jm901788j
BindingDB Entry DOI: 10.7270/Q23B608V