BDBM50308030 5-chloro-7-((4-ethoxyphenyl)(pyridin-3-ylamino)methyl)quinolin-8-ol::CHEMBL599255::cid_2977478
SMILES: CCOc1ccc(cc1)C(Nc1cccnc1)c1cc(Cl)c2cccnc2c1O
InChI Key: InChIKey=RDJCCPWITAIICC-UHFFFAOYSA-N
Data: 8 IC50  1 EC50
Activity Spreadsheet -- Enzyme Inhibition Constant Data from BindingDB
Found 9 hits for monomerid = 50308030
Trg + Lig
Ki
nM
ΔG°
kcal/mole
IC50
nM
Kd
nM
EC50/IC50
nM
koff
s-1
kon
M-1s-1
pHTemp
°C
Induced myeloid leukemia cell differentiation protein Mcl-1
(Homo sapiens (Human))
BDBM50308030
(5-chloro-7-((4-ethoxyphenyl)(pyridin-3-ylamino)met...)
Show SMILES CCOc1ccc(cc1)C(Nc1cccnc1)c1cc(Cl)c2cccnc2c1O
Show InChI InChI=1S/C23H20ClN3O2/c1-2-29-17-9-7-15(8-10-17)21(27-16-5-3-11-25-14-16)19-13-20(24)18-6-4-12-26-22(18)23(19)28/h3-14,21,27-28H,2H2,1H3
NCI pathway
PCBioAssay
n/an/a 3.35E+3n/an/an/an/an/an/a
Emory University Molecular Libraries Screening Center
Curated by PubChem BioAssay
Assay Description
NIH Molecular Libraries Screening Centers Network [MLSCN] Emory Chemical Biology Discovery Center in MLSCN Assay provider: Nikolovska-Coleska, Univer...
PubChem Bioassay (2008)
BindingDB Entry DOI: 10.7270/Q23X8539
neutrophil cytosolic factor 1
(Homo sapiens (Human))
BDBM50308030
(5-chloro-7-((4-ethoxyphenyl)(pyridin-3-ylamino)met...)
Show SMILES CCOc1ccc(cc1)C(Nc1cccnc1)c1cc(Cl)c2cccnc2c1O
Show InChI InChI=1S/C23H20ClN3O2/c1-2-29-17-9-7-15(8-10-17)21(27-16-5-3-11-25-14-16)19-13-20(24)18-6-4-12-26-22(18)23(19)28/h3-14,21,27-28H,2H2,1H3
Reactome pathway
PCBioAssay
n/an/a 5.00E+4n/an/an/an/an/an/a
Emory University Molecular Libraries Screening Center
Curated by PubChem BioAssay
Assay Description
NIH Molecular Libraries Screening Centers Network [MLSCN] Emory Chemical Biology Discovery Center in MLSCN Assay provider: Susan Smith, Emory Univers...
PubChem Bioassay (2008)
BindingDB Entry DOI: 10.7270/Q2M90723
LAP4
(Saccharomyces cerevisiae)
BDBM50308030
(5-chloro-7-((4-ethoxyphenyl)(pyridin-3-ylamino)met...)
Show SMILES CCOc1ccc(cc1)C(Nc1cccnc1)c1cc(Cl)c2cccnc2c1O
Show InChI InChI=1S/C23H20ClN3O2/c1-2-29-17-9-7-15(8-10-17)21(27-16-5-3-11-25-14-16)19-13-20(24)18-6-4-12-26-22(18)23(19)28/h3-14,21,27-28H,2H2,1H3
PCBioAssay
n/an/an/an/a>3.30E+4n/an/an/an/a
NMMLSC
Curated by PubChem BioAssay
Assay Description
University of New Mexico Assay Overview: Assay Support: 1R03 MH086450-01 Project Title: Chemical Screen of TOR pathway GFP fusion proteins in S. ...
PubChem Bioassay (2010)
BindingDB Entry DOI: 10.7270/Q21R6P02
Disintegrin and metalloproteinase domain-containing protein 10 (ADAM10)
(Homo sapiens (Human))
BDBM50308030
(5-chloro-7-((4-ethoxyphenyl)(pyridin-3-ylamino)met...)
Show SMILES CCOc1ccc(cc1)C(Nc1cccnc1)c1cc(Cl)c2cccnc2c1O
Show InChI InChI=1S/C23H20ClN3O2/c1-2-29-17-9-7-15(8-10-17)21(27-16-5-3-11-25-14-16)19-13-20(24)18-6-4-12-26-22(18)23(19)28/h3-14,21,27-28H,2H2,1H3
PCBioAssay
n/an/a 5.53E+3n/an/an/an/an/an/a
The Scripps Research Institute Molecular Screening Center
Curated by PubChem BioAssay
Assay Description
Source (MLPCN Center Name): The Scripps Research Institute Molecular Screening Center (SRIMSC) Center Affiliation: Torrey Pines Institute for Molecul...
PubChem Bioassay (2014)
BindingDB Entry DOI: 10.7270/Q2930RT9
botulinum neurotoxin type A
(Clostridium botulinum (strain Hall / ATCC 3502 / N...)
BDBM50308030
(5-chloro-7-((4-ethoxyphenyl)(pyridin-3-ylamino)met...)
Show SMILES CCOc1ccc(cc1)C(Nc1cccnc1)c1cc(Cl)c2cccnc2c1O
Show InChI InChI=1S/C23H20ClN3O2/c1-2-29-17-9-7-15(8-10-17)21(27-16-5-3-11-25-14-16)19-13-20(24)18-6-4-12-26-22(18)23(19)28/h3-14,21,27-28H,2H2,1H3
n/an/a 2.10E+3n/an/an/an/an/an/a
TBA
Curated by ChEMBL
Assay Description
Inhibition of Clostridium botulinum Hall BoNT/A protease activity using Ac-SNKTRIDEANQRATKML-NH2 as substrate after 5 mins by RP-HPLC analysis
ACS Med Chem Lett 3: 387-391 (2012)
Article DOI: 10.1021/ml200312s
BindingDB Entry DOI: 10.7270/Q2KK9CVX
Botulinum neurotoxin type A
(Clostridium botulinum)
BDBM50308030
(5-chloro-7-((4-ethoxyphenyl)(pyridin-3-ylamino)met...)
Show SMILES CCOc1ccc(cc1)C(Nc1cccnc1)c1cc(Cl)c2cccnc2c1O
Show InChI InChI=1S/C23H20ClN3O2/c1-2-29-17-9-7-15(8-10-17)21(27-16-5-3-11-25-14-16)19-13-20(24)18-6-4-12-26-22(18)23(19)28/h3-14,21,27-28H,2H2,1H3
NCI pathway
Reactome pathway
n/an/a 2.10E+3n/an/an/an/an/an/a
U.S. Army Medical Research Institute of Infectious Diseases
Curated by ChEMBL
Assay Description
Inhibition of protease activity of recombinant full-length Clostridium botulinum BoNT/A light chain after 5 mins by HPLC-based assay
Antimicrob Agents Chemother 53: 3478-86 (2009)
Article DOI: 10.1128/AAC.00141-09
BindingDB Entry DOI: 10.7270/Q2N29X7X
Botulinum neurotoxin type A
(Clostridium botulinum)
BDBM50308030
(5-chloro-7-((4-ethoxyphenyl)(pyridin-3-ylamino)met...)
Show SMILES CCOc1ccc(cc1)C(Nc1cccnc1)c1cc(Cl)c2cccnc2c1O
Show InChI InChI=1S/C23H20ClN3O2/c1-2-29-17-9-7-15(8-10-17)21(27-16-5-3-11-25-14-16)19-13-20(24)18-6-4-12-26-22(18)23(19)28/h3-14,21,27-28H,2H2,1H3
NCI pathway
Reactome pathway
n/an/a 1.60E+3n/an/an/an/an/an/a
U.S. Army Medical Research Institute of Infectious Diseases
Curated by ChEMBL
Assay Description
Inhibition of protease activity of recombinant Clostridium botulinum BoNT/A (1 to 425) light chain after 5 mins by HPLC-based assay
Antimicrob Agents Chemother 53: 3478-86 (2009)
Article DOI: 10.1128/AAC.00141-09
BindingDB Entry DOI: 10.7270/Q2N29X7X
Botulinum neurotoxin type A
(Clostridium botulinum)
BDBM50308030
(5-chloro-7-((4-ethoxyphenyl)(pyridin-3-ylamino)met...)
Show SMILES CCOc1ccc(cc1)C(Nc1cccnc1)c1cc(Cl)c2cccnc2c1O
Show InChI InChI=1S/C23H20ClN3O2/c1-2-29-17-9-7-15(8-10-17)21(27-16-5-3-11-25-14-16)19-13-20(24)18-6-4-12-26-22(18)23(19)28/h3-14,21,27-28H,2H2,1H3
NCI pathway
Reactome pathway
n/an/a 500n/an/an/an/an/an/a
Microbiotix Inc
Curated by ChEMBL
Assay Description
Inhibition of Clostridium botulinum toxin BoNT/A light chain
J Med Chem 53: 2264-76 (2010)
Article DOI: 10.1021/jm901852f
BindingDB Entry DOI: 10.7270/Q2HQ40V7
Disintegrin and metalloproteinase domain-containing protein 17
(Homo sapiens (Human))
BDBM50308030
(5-chloro-7-((4-ethoxyphenyl)(pyridin-3-ylamino)met...)
Show SMILES CCOc1ccc(cc1)C(Nc1cccnc1)c1cc(Cl)c2cccnc2c1O
Show InChI InChI=1S/C23H20ClN3O2/c1-2-29-17-9-7-15(8-10-17)21(27-16-5-3-11-25-14-16)19-13-20(24)18-6-4-12-26-22(18)23(19)28/h3-14,21,27-28H,2H2,1H3
Reactome pathway
PCBioAssay
n/an/a 9.11E+3n/an/an/an/an/an/a
The Scripps Research Institute Molecular Screening Center
Curated by PubChem BioAssay
Assay Description
Source (MLPCN Center Name): The Scripps Research Institute Molecular Screening Center (SRIMSC) Center Affiliation: Torrey Pines Institute for Molecul...
PubChem Bioassay (2014)
BindingDB Entry DOI: 10.7270/Q2DV1HJQ