BDBM50308066 1-Isopropyl-4-(4-cyclopropyl-phenyl)-6-methoxy-1H-quinazolin-2-one::CHEMBL599665
SMILES: COc1ccc2n(C(C)C)c(=O)nc(-c3ccc(cc3)C3CC3)c2c1
InChI Key: InChIKey=COGOPHJRGGXFEO-UHFFFAOYSA-N
Data: 1 IC50
Activity Spreadsheet -- Enzyme Inhibition Constant Data from BindingDB
Found 1 hit for monomerid = 50308066
Trg + Lig
Ki
nM
ΔG°
kcal/mole
IC50
nM
Kd
nM
EC50/IC50
nM
koff
s-1
kon
M-1s-1
pHTemp
°C
Calcium-sensing receptor (CaSR)
(Homo sapiens (Human))
BDBM50308066
(1-Isopropyl-4-(4-cyclopropyl-phenyl)-6-methoxy-1H-...)
Show SMILES COc1ccc2n(C(C)C)c(=O)nc(-c3ccc(cc3)C3CC3)c2c1
Show InChI InChI=1S/C21H22N2O2/c1-13(2)23-19-11-10-17(25-3)12-18(19)20(22-21(23)24)16-8-6-15(7-9-16)14-4-5-14/h6-14H,4-5H2,1-3H3
n/an/a 3.30E+3n/an/an/an/an/an/a
Novartis Institutes for BioMedical Research
Curated by ChEMBL
Assay Description
Antagonist activity at human CaSR expressed in CCL39 cells assessed as inhibition of extracellular calcium-induced intracellular calcium transient by...
J Med Chem 53: 2250-63 (2010)
Article DOI: 10.1021/jm901811v
BindingDB Entry DOI: 10.7270/Q2Q240BT