null
SMILES: CCCN(CCC)c1ccc2n(C(C)C)c(=O)nc(-c3ccc(cc3)C(C)C)c2c1
InChI Key: InChIKey=AFBLVZYFLXGQGO-UHFFFAOYSA-N
Activity Spreadsheet -- Enzyme Inhibition Constant Data from BindingDB
Found 1 hit for monomerid = 50308097
Trg + Lig
Ki
nM
ΔG°
kcal/mole
IC50
nM
Kd
nM
EC50/IC50
nM
koff
s-1
kon
M-1s-1
pHTemp
°C
Extracellular calcium-sensing receptor
(Homo sapiens (Human))
BDBM50308097
(6-Dipropylamino-1-isopropyl-4-(4-isopropyl-phenyl)...)
Show SMILES CCCN(CCC)c1ccc2n(C(C)C)c(=O)nc(-c3ccc(cc3)C(C)C)c2c1
Show InChI InChI=1S/C26H35N3O/c1-7-15-28(16-8-2)22-13-14-24-23(17-22)25(27-26(30)29(24)19(5)6)21-11-9-20(10-12-21)18(3)4/h9-14,17-19H,7-8,15-16H2,1-6H3
n/an/a 2.90E+3n/an/an/an/an/an/a
Novartis Institutes for BioMedical Research
Curated by ChEMBL
Assay Description
Antagonist activity at human CaSR expressed in CCL39 cells assessed as inhibition of extracellular calcium-induced intracellular calcium transient by...
J Med Chem 53: 2250-63 (2010)
Article DOI: 10.1021/jm901811v
BindingDB Entry DOI: 10.7270/Q2Q240BT