BDBM50308106 5-Allyl-1-benzyl-6-hydroxy-4-(4-isopropyl-phenyl)-1H-quinazolin-2-one::CHEMBL598638
SMILES: CC(C)c1ccc(cc1)-c1nc(=O)n(Cc2ccccc2)c2ccc(O)c(CC=C)c12
InChI Key: InChIKey=MOQMUMSCPKLYMB-UHFFFAOYSA-N
Data: 1 IC50
Activity Spreadsheet -- Enzyme Inhibition Constant Data from BindingDB
Found 1 hit for monomerid = 50308106
Trg + Lig
Ki
nM
ΔG°
kcal/mole
IC50
nM
Kd
nM
EC50/IC50
nM
koff
s-1
kon
M-1s-1
pHTemp
°C
Calcium-sensing receptor (CaSR)
(Homo sapiens (Human))
BDBM50308106
(5-Allyl-1-benzyl-6-hydroxy-4-(4-isopropyl-phenyl)-...)
Show SMILES CC(C)c1ccc(cc1)-c1nc(=O)n(Cc2ccccc2)c2ccc(O)c(CC=C)c12
Show InChI InChI=1S/C27H26N2O2/c1-4-8-22-24(30)16-15-23-25(22)26(21-13-11-20(12-14-21)18(2)3)28-27(31)29(23)17-19-9-6-5-7-10-19/h4-7,9-16,18,30H,1,8,17H2,2-3H3
n/an/a 3.90n/an/an/an/an/an/a
Novartis Institutes for BioMedical Research
Curated by ChEMBL
Assay Description
Antagonist activity at human CaSR expressed in CCL39 cells assessed as inhibition of extracellular calcium-induced intracellular calcium transient by...
J Med Chem 53: 2250-63 (2010)
Article DOI: 10.1021/jm901811v
BindingDB Entry DOI: 10.7270/Q2Q240BT