null
SMILES: CCOc1ccc(Nc2ncc3CC(=O)Nc4cc(OC)ccc4-c3n2)cc1
InChI Key: InChIKey=YOYKFXWWRVKLLS-UHFFFAOYSA-N
Activity Spreadsheet -- Enzyme Inhibition Constant Data from BindingDB
Found 4 hits for monomerid = 50308193
Trg + Lig
Ki
nM
ΔG°
kcal/mole
IC50
nM
Kd
nM
EC50/IC50
nM
koff
s-1
kon
M-1s-1
pHTemp
°C
Serine/threonine-protein kinase PLK1
(Homo sapiens (Human))
BDBM50308193
(2-(4-Ethoxyanilino)-9-methoxy-5,7-dihydro-6H-pyrim...)
Show SMILES CCOc1ccc(Nc2ncc3CC(=O)Nc4cc(OC)ccc4-c3n2)cc1
Show InChI InChI=1S/C21H20N4O3/c1-3-28-15-6-4-14(5-7-15)23-21-22-12-13-10-19(26)24-18-11-16(27-2)8-9-17(18)20(13)25-21/h4-9,11-12H,3,10H2,1-2H3,(H,24,26)(H,22,23,25)
NCI pathway
Reactome pathway
n/an/a 7.30E+3n/an/an/an/an/an/a
Technische Universitat Braunschweig
Curated by ChEMBL
Assay Description
Inhibition of PLK1 assessed as [33Pi] incorporation by microplate scintillation counting in presence of 1 uM ATP
J Med Chem 53: 2433-42 (2010)
Article DOI: 10.1021/jm901388c
BindingDB Entry DOI: 10.7270/Q24J0G22
Vascular endothelial growth factor receptor 2
(Homo sapiens (Human))
BDBM50308193
(2-(4-Ethoxyanilino)-9-methoxy-5,7-dihydro-6H-pyrim...)
Show SMILES CCOc1ccc(Nc2ncc3CC(=O)Nc4cc(OC)ccc4-c3n2)cc1
Show InChI InChI=1S/C21H20N4O3/c1-3-28-15-6-4-14(5-7-15)23-21-22-12-13-10-19(26)24-18-11-16(27-2)8-9-17(18)20(13)25-21/h4-9,11-12H,3,10H2,1-2H3,(H,24,26)(H,22,23,25)
NCI pathway
Reactome pathway
n/an/a 52n/an/an/an/an/an/a
Technische Universitat Braunschweig
Curated by ChEMBL
Assay Description
Inhibition of VEGFR2 assessed as [33Pi] incorporation by microplate scintillation counting in presence of 1 uM ATP
J Med Chem 53: 2433-42 (2010)
Article DOI: 10.1021/jm901388c
BindingDB Entry DOI: 10.7270/Q24J0G22
Vascular endothelial growth factor receptor 2
(Homo sapiens (Human))
BDBM50308193
(2-(4-Ethoxyanilino)-9-methoxy-5,7-dihydro-6H-pyrim...)
Show SMILES CCOc1ccc(Nc2ncc3CC(=O)Nc4cc(OC)ccc4-c3n2)cc1
Show InChI InChI=1S/C21H20N4O3/c1-3-28-15-6-4-14(5-7-15)23-21-22-12-13-10-19(26)24-18-11-16(27-2)8-9-17(18)20(13)25-21/h4-9,11-12H,3,10H2,1-2H3,(H,24,26)(H,22,23,25)
NCI pathway
Reactome pathway
n/an/a 290n/an/an/an/an/an/a
Technische Universitat Braunschweig
Curated by ChEMBL
Assay Description
Inhibition of VEGFR2 in HUE cells assessed as inhibition of VEGF-induced autophosphorylation treated for 90 mins before VEGF challenge by ELISA
J Med Chem 53: 2433-42 (2010)
Article DOI: 10.1021/jm901388c
BindingDB Entry DOI: 10.7270/Q24J0G22
Insulin receptor
(Homo sapiens (Human))
BDBM50308193
(2-(4-Ethoxyanilino)-9-methoxy-5,7-dihydro-6H-pyrim...)
Show SMILES CCOc1ccc(Nc2ncc3CC(=O)Nc4cc(OC)ccc4-c3n2)cc1
Show InChI InChI=1S/C21H20N4O3/c1-3-28-15-6-4-14(5-7-15)23-21-22-12-13-10-19(26)24-18-11-16(27-2)8-9-17(18)20(13)25-21/h4-9,11-12H,3,10H2,1-2H3,(H,24,26)(H,22,23,25)
n/an/a>1.00E+5n/an/an/an/an/an/a
Technische Universitat Braunschweig
Curated by ChEMBL
Assay Description
Inhibition of INSR assessed as [33Pi] incorporation by microplate scintillation counting in presence of 1 uM ATP
J Med Chem 53: 2433-42 (2010)
Article DOI: 10.1021/jm901388c
BindingDB Entry DOI: 10.7270/Q24J0G22