BDBM50308255 1-O-Methyl-2,3-O-isopropylidene-5-(4-phenyl-1H-1,2,3-triazol-1-yl)-beta-D-ribofuranose::CHEMBL598822
SMILES: CO[C@@H]1O[C@H](Cn2cc(nn2)-c2ccccc2)[C@H]2OC(C)(C)O[C@@H]12
InChI Key: InChIKey=HBBIFWIMEWGNHN-KLHDSHLOSA-N
Data: 1 IC50
Activity Spreadsheet -- Enzyme Inhibition Constant Data from BindingDB
Found 1 hit for monomerid = 50308255
Trg + Lig
Ki
nM
ΔG°
kcal/mole
IC50
nM
Kd
nM
EC50/IC50
nM
koff
s-1
kon
M-1s-1
pHTemp
°C
Alpha-glucosidase MAL12
(Saccharomyces cerevisiae)
BDBM50308255
(1-O-Methyl-2,3-O-isopropylidene-5-(4-phenyl-1H-1,2...)
Show SMILES CO[C@@H]1O[C@H](Cn2cc(nn2)-c2ccccc2)[C@H]2OC(C)(C)O[C@@H]12 |r|
Show InChI InChI=1S/C17H21N3O4/c1-17(2)23-14-13(22-16(21-3)15(14)24-17)10-20-9-12(18-19-20)11-7-5-4-6-8-11/h4-9,13-16H,10H2,1-3H3/t13-,14-,15-,16-/m1/s1
Reactome pathway
n/an/a 1.49E+4n/an/an/an/an/an/a
Universidade Federal do Rio de Janeiro
Curated by ChEMBL
Assay Description
Inhibition of yeast alpha-glucosidase MAL12 assessed as inhibition of p-nitrophenol release by spectrophotometry
J Med Chem 53: 2364-75 (2010)
Article DOI: 10.1021/jm901265h
BindingDB Entry DOI: 10.7270/Q20R9QC7