BDBM50308553 (S)-3-(4-(2-hydroxypropyl)piperazin-1-yl)-1-(2-isopropoxyethyl)-7-(6-methoxypyridin-3-yl)pyrido[3,4-b]pyrazin-2(1H)-one::CHEMBL589797
SMILES: CCCOCCn1c2cc(ncc2nc(N2CCN(C[C@H](C)O)CC2)c1=O)-c1ccc(OC)nc1
InChI Key: InChIKey=JWZQBERYCMZHJF-SFHVURJKSA-N
Data: 1 IC50
Activity Spreadsheet -- Enzyme Inhibition Constant Data from BindingDB
Found 1 hit for monomerid = 50308553
Trg + Lig
Ki
nM
ΔG°
kcal/mole
IC50
nM
Kd
nM
EC50/IC50
nM
koff
s-1
kon
M-1s-1
pHTemp
°C
cGMP-specific 3',5'-cyclic phosphodiesterase
(Homo sapiens (Human))
BDBM50308553
((S)-3-(4-(2-hydroxypropyl)piperazin-1-yl)-1-(2-iso...)
Show SMILES CCCOCCn1c2cc(ncc2nc(N2CCN(C[C@H](C)O)CC2)c1=O)-c1ccc(OC)nc1 |r|
Show InChI InChI=1S/C25H34N6O4/c1-4-12-35-13-11-31-22-14-20(19-5-6-23(34-3)27-15-19)26-16-21(22)28-24(25(31)33)30-9-7-29(8-10-30)17-18(2)32/h5-6,14-16,18,32H,4,7-13,17H2,1-3H3/t18-/m0/s1
Reactome pathway
n/an/a 0.310n/an/an/an/an/an/a
Pfizer Global Research and Development
Curated by ChEMBL
Assay Description
Inhibition of human platelet PDE5 assessed as reduction in conversion of [3H]cGMP to [3H]GMP after 2 hr by scintillation proximity assay
J Med Chem 53: 2656-60 (2010)
Article DOI: 10.1021/jm901781q
BindingDB Entry DOI: 10.7270/Q2VM4CCK