BDBM50308561 (+/-)-3-(4-((2R,3R)-3-hydroxybutan-2-yl)piperazin-1-yl)-1-(2-propoxyethyl)-7-(6-methoxypyridin-3-yl)pyrido[3,4-b]pyrazin-2(1H)-one::CHEMBL591942
SMILES: CCCOCCn1c2cc(ncc2nc(N2CCN(CC2)[C@H](C)[C@@H](C)O)c1=O)-c1ccc(OC)nc1
InChI Key: InChIKey=ZZHCAPMRVHYZMC-RTBURBONSA-N
Data: 1 IC50
Activity Spreadsheet -- Enzyme Inhibition Constant Data from BindingDB
Found 1 hit for monomerid = 50308561
Trg + Lig
Ki
nM
ΔG°
kcal/mole
IC50
nM
Kd
nM
EC50/IC50
nM
koff
s-1
kon
M-1s-1
pHTemp
°C
cGMP-specific 3',5'-cyclic phosphodiesterase
(Homo sapiens (Human))
BDBM50308561
((+/-)-3-(4-((2R,3R)-3-hydroxybutan-2-yl)piperazin-...)
Show SMILES CCCOCCn1c2cc(ncc2nc(N2CCN(CC2)[C@H](C)[C@@H](C)O)c1=O)-c1ccc(OC)nc1 |r|
Show InChI InChI=1S/C26H36N6O4/c1-5-13-36-14-12-32-23-15-21(20-6-7-24(35-4)28-16-20)27-17-22(23)29-25(26(32)34)31-10-8-30(9-11-31)18(2)19(3)33/h6-7,15-19,33H,5,8-14H2,1-4H3/t18-,19-/m1/s1
Reactome pathway
n/an/a 0.300n/an/an/an/an/an/a
Pfizer Global Research and Development
Curated by ChEMBL
Assay Description
Inhibition of human platelet PDE5 assessed as reduction in conversion of [3H]cGMP to [3H]GMP after 2 hr by scintillation proximity assay
J Med Chem 53: 2656-60 (2010)
Article DOI: 10.1021/jm901781q
BindingDB Entry DOI: 10.7270/Q2VM4CCK