null
SMILES: [#7]\[#6](-[#7])=[#7]\[#6]-[#6]-[#6]-[#6@@H]-1-[#7]-[#6](=O)-[#6](-[#7]-[#6](=O)-[#6@@H](-[#6]-c2ccccc2)-[#7]-[#6](=O)-[#6@H](-[#6]-[#6](-[#8])=O)-[#7]-[#6](=O)-[#6]-[#7]-[#6]-1=O)-c1ccc(-[#6]-[#7]-[#6](=O)-[#6]-[#8]-[#6]-[#6]-[#8]-[#6]-[#6]-[#8]-[#6]-[#6](-[#8])=O)cc1
InChI Key: InChIKey=JANXNGXRGZTCLF-QONNLAFFSA-N
Activity Spreadsheet -- Enzyme Inhibition Constant Data from BindingDB
Found 6 hits for monomerid = 50308728
Trg + Lig
Ki
nM
ΔG°
kcal/mole
IC50
nM
Kd
nM
EC50/IC50
nM
koff
s-1
kon
M-1s-1
pHTemp
°C
Integrin alpha-V
(Homo sapiens (Human))
BDBM50308728
(1-(4-((5S,11S,14R)-14-benzyl-11-(carboxymethyl)-5-...)
Show SMILES [#7]\[#6](-[#7])=[#7]\[#6]-[#6]-[#6]-[#6@@H]-1-[#7]-[#6](=O)-[#6](-[#7]-[#6](=O)-[#6@@H](-[#6]-c2ccccc2)-[#7]-[#6](=O)-[#6@H](-[#6]-[#6](-[#8])=O)-[#7]-[#6](=O)-[#6]-[#7]-[#6]-1=O)-c1ccc(-[#6]-[#7]-[#6](=O)-[#6]-[#8]-[#6]-[#6]-[#8]-[#6]-[#6]-[#8]-[#6]-[#6](-[#8])=O)cc1 |r|
Show InChI InChI=1S/C38H51N9O13/c39-38(40)41-12-4-7-26-34(54)43-20-29(48)44-28(18-31(50)51)35(55)46-27(17-23-5-2-1-3-6-23)36(56)47-33(37(57)45-26)25-10-8-24(9-11-25)19-42-30(49)21-59-15-13-58-14-16-60-22-32(52)53/h1-3,5-6,8-11,26-28,33H,4,7,12-22H2,(H,42,49)(H,43,54)(H,44,48)(H,45,57)(H,46,55)(H,47,56)(H,50,51)(H,52,53)(H4,39,40,41)/t26-,27+,28-,33?/m0/s1
NCI pathway
Reactome pathway
n/an/a 1.88E+4n/an/an/an/an/an/a
Istituto di Ricerche Chimiche e Biochimiche G.Ronzoni
Curated by ChEMBL
Assay Description
Inhibition of integrin alphaV receptor-mediated adhesion of human PC3 cells to vitronectin after 1 hr by toluidine blue staining
Bioorg Med Chem 18: 64-72 (2010)
Article DOI: 10.1016/j.bmc.2009.11.019
BindingDB Entry DOI: 10.7270/Q2FF3SG2
Integrin alpha-V/beta-3
(Homo sapiens (Human))
BDBM50308728
(1-(4-((5S,11S,14R)-14-benzyl-11-(carboxymethyl)-5-...)
Show SMILES [#7]\[#6](-[#7])=[#7]\[#6]-[#6]-[#6]-[#6@@H]-1-[#7]-[#6](=O)-[#6](-[#7]-[#6](=O)-[#6@@H](-[#6]-c2ccccc2)-[#7]-[#6](=O)-[#6@H](-[#6]-[#6](-[#8])=O)-[#7]-[#6](=O)-[#6]-[#7]-[#6]-1=O)-c1ccc(-[#6]-[#7]-[#6](=O)-[#6]-[#8]-[#6]-[#6]-[#8]-[#6]-[#6]-[#8]-[#6]-[#6](-[#8])=O)cc1 |r|
Show InChI InChI=1S/C38H51N9O13/c39-38(40)41-12-4-7-26-34(54)43-20-29(48)44-28(18-31(50)51)35(55)46-27(17-23-5-2-1-3-6-23)36(56)47-33(37(57)45-26)25-10-8-24(9-11-25)19-42-30(49)21-59-15-13-58-14-16-60-22-32(52)53/h1-3,5-6,8-11,26-28,33H,4,7,12-22H2,(H,42,49)(H,43,54)(H,44,48)(H,45,57)(H,46,55)(H,47,56)(H,50,51)(H,52,53)(H4,39,40,41)/t26-,27+,28-,33?/m0/s1
n/an/a 1.07E+4n/an/an/an/an/an/a
Istituto di Ricerche Chimiche e Biochimiche G.Ronzoni
Curated by ChEMBL
Assay Description
Inhibition of integrin alphaVbeta3 receptor-mediated adhesion of human A498 cells to vitronectin after 1 hr by toluidine blue staining
Bioorg Med Chem 18: 64-72 (2010)
Article DOI: 10.1016/j.bmc.2009.11.019
BindingDB Entry DOI: 10.7270/Q2FF3SG2
Integrin alpha-V/beta-3
(Homo sapiens (Human))
BDBM50308728
(1-(4-((5S,11S,14R)-14-benzyl-11-(carboxymethyl)-5-...)
Show SMILES [#7]\[#6](-[#7])=[#7]\[#6]-[#6]-[#6]-[#6@@H]-1-[#7]-[#6](=O)-[#6](-[#7]-[#6](=O)-[#6@@H](-[#6]-c2ccccc2)-[#7]-[#6](=O)-[#6@H](-[#6]-[#6](-[#8])=O)-[#7]-[#6](=O)-[#6]-[#7]-[#6]-1=O)-c1ccc(-[#6]-[#7]-[#6](=O)-[#6]-[#8]-[#6]-[#6]-[#8]-[#6]-[#6]-[#8]-[#6]-[#6](-[#8])=O)cc1 |r|
Show InChI InChI=1S/C38H51N9O13/c39-38(40)41-12-4-7-26-34(54)43-20-29(48)44-28(18-31(50)51)35(55)46-27(17-23-5-2-1-3-6-23)36(56)47-33(37(57)45-26)25-10-8-24(9-11-25)19-42-30(49)21-59-15-13-58-14-16-60-22-32(52)53/h1-3,5-6,8-11,26-28,33H,4,7,12-22H2,(H,42,49)(H,43,54)(H,44,48)(H,45,57)(H,46,55)(H,47,56)(H,50,51)(H,52,53)(H4,39,40,41)/t26-,27+,28-,33?/m0/s1
n/an/a 4n/an/an/an/an/an/a
Istituto di Ricerche Chimiche e Biochimiche G.Ronzoni
Curated by ChEMBL
Assay Description
Displacement of [125I]echistatin from integrin alphaVbeta3 receptor after 3 hrs by gamma counting
Bioorg Med Chem 18: 64-72 (2010)
Article DOI: 10.1016/j.bmc.2009.11.019
BindingDB Entry DOI: 10.7270/Q2FF3SG2
Integrin alpha-V/beta-5
(Homo sapiens (Human))
BDBM50308728
(1-(4-((5S,11S,14R)-14-benzyl-11-(carboxymethyl)-5-...)
Show SMILES [#7]\[#6](-[#7])=[#7]\[#6]-[#6]-[#6]-[#6@@H]-1-[#7]-[#6](=O)-[#6](-[#7]-[#6](=O)-[#6@@H](-[#6]-c2ccccc2)-[#7]-[#6](=O)-[#6@H](-[#6]-[#6](-[#8])=O)-[#7]-[#6](=O)-[#6]-[#7]-[#6]-1=O)-c1ccc(-[#6]-[#7]-[#6](=O)-[#6]-[#8]-[#6]-[#6]-[#8]-[#6]-[#6]-[#8]-[#6]-[#6](-[#8])=O)cc1 |r|
Show InChI InChI=1S/C38H51N9O13/c39-38(40)41-12-4-7-26-34(54)43-20-29(48)44-28(18-31(50)51)35(55)46-27(17-23-5-2-1-3-6-23)36(56)47-33(37(57)45-26)25-10-8-24(9-11-25)19-42-30(49)21-59-15-13-58-14-16-60-22-32(52)53/h1-3,5-6,8-11,26-28,33H,4,7,12-22H2,(H,42,49)(H,43,54)(H,44,48)(H,45,57)(H,46,55)(H,47,56)(H,50,51)(H,52,53)(H4,39,40,41)/t26-,27+,28-,33?/m0/s1
NCI pathway
Reactome pathway
n/an/a 1.23E+4n/an/an/an/an/an/a
Istituto di Ricerche Chimiche e Biochimiche G.Ronzoni
Curated by ChEMBL
Assay Description
Inhibition of integrin alphaVbeta5 receptor-mediated adhesion of human A2780 cells to vitronectin after 1 hr by toluidine blue staining
Bioorg Med Chem 18: 64-72 (2010)
Article DOI: 10.1016/j.bmc.2009.11.019
BindingDB Entry DOI: 10.7270/Q2FF3SG2
Integrin alpha-V/beta-5
(Homo sapiens (Human))
BDBM50308728
(1-(4-((5S,11S,14R)-14-benzyl-11-(carboxymethyl)-5-...)
Show SMILES [#7]\[#6](-[#7])=[#7]\[#6]-[#6]-[#6]-[#6@@H]-1-[#7]-[#6](=O)-[#6](-[#7]-[#6](=O)-[#6@@H](-[#6]-c2ccccc2)-[#7]-[#6](=O)-[#6@H](-[#6]-[#6](-[#8])=O)-[#7]-[#6](=O)-[#6]-[#7]-[#6]-1=O)-c1ccc(-[#6]-[#7]-[#6](=O)-[#6]-[#8]-[#6]-[#6]-[#8]-[#6]-[#6]-[#8]-[#6]-[#6](-[#8])=O)cc1 |r|
Show InChI InChI=1S/C38H51N9O13/c39-38(40)41-12-4-7-26-34(54)43-20-29(48)44-28(18-31(50)51)35(55)46-27(17-23-5-2-1-3-6-23)36(56)47-33(37(57)45-26)25-10-8-24(9-11-25)19-42-30(49)21-59-15-13-58-14-16-60-22-32(52)53/h1-3,5-6,8-11,26-28,33H,4,7,12-22H2,(H,42,49)(H,43,54)(H,44,48)(H,45,57)(H,46,55)(H,47,56)(H,50,51)(H,52,53)(H4,39,40,41)/t26-,27+,28-,33?/m0/s1
NCI pathway
Reactome pathway
n/an/a 0.350n/an/an/an/an/an/a
Istituto di Ricerche Chimiche e Biochimiche G.Ronzoni
Curated by ChEMBL
Assay Description
Displacement of [125I]echistatin from integrin alphaVbeta5 receptor after 3 hrs by gamma counting
Bioorg Med Chem 18: 64-72 (2010)
Article DOI: 10.1016/j.bmc.2009.11.019
BindingDB Entry DOI: 10.7270/Q2FF3SG2
Integrin alpha-V/beta-5
(Homo sapiens (Human))
BDBM50308728
(1-(4-((5S,11S,14R)-14-benzyl-11-(carboxymethyl)-5-...)
Show SMILES [#7]\[#6](-[#7])=[#7]\[#6]-[#6]-[#6]-[#6@@H]-1-[#7]-[#6](=O)-[#6](-[#7]-[#6](=O)-[#6@@H](-[#6]-c2ccccc2)-[#7]-[#6](=O)-[#6@H](-[#6]-[#6](-[#8])=O)-[#7]-[#6](=O)-[#6]-[#7]-[#6]-1=O)-c1ccc(-[#6]-[#7]-[#6](=O)-[#6]-[#8]-[#6]-[#6]-[#8]-[#6]-[#6]-[#8]-[#6]-[#6](-[#8])=O)cc1 |r|
Show InChI InChI=1S/C38H51N9O13/c39-38(40)41-12-4-7-26-34(54)43-20-29(48)44-28(18-31(50)51)35(55)46-27(17-23-5-2-1-3-6-23)36(56)47-33(37(57)45-26)25-10-8-24(9-11-25)19-42-30(49)21-59-15-13-58-14-16-60-22-32(52)53/h1-3,5-6,8-11,26-28,33H,4,7,12-22H2,(H,42,49)(H,43,54)(H,44,48)(H,45,57)(H,46,55)(H,47,56)(H,50,51)(H,52,53)(H4,39,40,41)/t26-,27+,28-,33?/m0/s1
NCI pathway
Reactome pathway
n/an/a 1.07E+4n/an/an/an/an/an/a
Istituto di Ricerche Chimiche e Biochimiche G.Ronzoni
Curated by ChEMBL
Assay Description
Inhibition of integrin alphaVbeta5 receptor-mediated adhesion of human A498 cells to vitronectin after 1 hr by toluidine blue staining
Bioorg Med Chem 18: 64-72 (2010)
Article DOI: 10.1016/j.bmc.2009.11.019
BindingDB Entry DOI: 10.7270/Q2FF3SG2