BDBM50308737 CHEMBL600844::n-Butyl-2-methyl-5-[4-(methylsulfonyl)phenyl]-1-[3-(fluoro)phenyl]-1H-pyrrol-3-acetate
SMILES: CCCCOC(=O)Cc1cc(-c2ccc(cc2)S(C)(=O)=O)n(c1C)-c1cccc(F)c1
InChI Key: InChIKey=QPNNHESIIGBWRN-UHFFFAOYSA-N
Data: 4 IC50
Activity Spreadsheet -- Enzyme Inhibition Constant Data from BindingDB
Found 4 hits for monomerid = 50308737
Trg + Lig
Ki
nM
ΔG°
kcal/mole
IC50
nM
Kd
nM
EC50/IC50
nM
koff
s-1
kon
M-1s-1
pHTemp
°C
Cyclooxygenase-2 (COX-2)
(Mus musculus (Mouse))
BDBM50308737
(CHEMBL600844 | n-Butyl-2-methyl-5-[4-(methylsulfon...)
Show SMILES CCCCOC(=O)Cc1cc(-c2ccc(cc2)S(C)(=O)=O)n(c1C)-c1cccc(F)c1
Show InChI InChI=1S/C24H26FNO4S/c1-4-5-13-30-24(27)15-19-14-23(18-9-11-22(12-10-18)31(3,28)29)26(17(19)2)21-8-6-7-20(25)16-21/h6-12,14,16H,4-5,13,15H2,1-3H3
n/an/a 1.00E+5n/an/an/an/an/an/a
Universit£ La Sapienza
Curated by ChEMBL
Assay Description
Inhibition of COX2-dependent PGE2 production in LPS-stimulated mouse J774 cells at 10 uM by RIA
J Med Chem 53: 723-33 (2010)
Article DOI: 10.1021/jm901269y
BindingDB Entry DOI: 10.7270/Q25X291D
Cyclooxygenase-2 (COX-2)
(Mus musculus (Mouse))
BDBM50308737
(CHEMBL600844 | n-Butyl-2-methyl-5-[4-(methylsulfon...)
Show SMILES CCCCOC(=O)Cc1cc(-c2ccc(cc2)S(C)(=O)=O)n(c1C)-c1cccc(F)c1
Show InChI InChI=1S/C24H26FNO4S/c1-4-5-13-30-24(27)15-19-14-23(18-9-11-22(12-10-18)31(3,28)29)26(17(19)2)21-8-6-7-20(25)16-21/h6-12,14,16H,4-5,13,15H2,1-3H3
n/an/a 8.70E+4n/an/an/an/an/an/a
Universit£ La Sapienza
Curated by ChEMBL
Assay Description
Inhibition of COX2-dependent PGE2 production in LPS-stimulated mouse J774 cells at 1 uM by RIA
J Med Chem 53: 723-33 (2010)
Article DOI: 10.1021/jm901269y
BindingDB Entry DOI: 10.7270/Q25X291D
Prostaglandin G/H synthase (cyclooxygenase)
(Mus musculus)
BDBM50308737
(CHEMBL600844 | n-Butyl-2-methyl-5-[4-(methylsulfon...)
Show SMILES CCCCOC(=O)Cc1cc(-c2ccc(cc2)S(C)(=O)=O)n(c1C)-c1cccc(F)c1
Show InChI InChI=1S/C24H26FNO4S/c1-4-5-13-30-24(27)15-19-14-23(18-9-11-22(12-10-18)31(3,28)29)26(17(19)2)21-8-6-7-20(25)16-21/h6-12,14,16H,4-5,13,15H2,1-3H3
Reactome pathway
n/an/a>1.00E+5n/an/an/an/an/an/a
Universit£ La Sapienza
Curated by ChEMBL
Assay Description
Inhibition of COX1-dependent PGE2 production in LPS-stimulated mouse J774 cells by RIA
J Med Chem 53: 723-33 (2010)
Article DOI: 10.1021/jm901269y
BindingDB Entry DOI: 10.7270/Q25X291D
Cyclooxygenase-2 (COX-2)
(Mus musculus (Mouse))
BDBM50308737
(CHEMBL600844 | n-Butyl-2-methyl-5-[4-(methylsulfon...)
Show SMILES CCCCOC(=O)Cc1cc(-c2ccc(cc2)S(C)(=O)=O)n(c1C)-c1cccc(F)c1
Show InChI InChI=1S/C24H26FNO4S/c1-4-5-13-30-24(27)15-19-14-23(18-9-11-22(12-10-18)31(3,28)29)26(17(19)2)21-8-6-7-20(25)16-21/h6-12,14,16H,4-5,13,15H2,1-3H3
n/an/a 24n/an/an/an/an/an/a
Universit£ La Sapienza
Curated by ChEMBL
Assay Description
Inhibition of COX2-dependent PGE2 production in LPS-stimulated mouse J774 cells by RIA
J Med Chem 53: 723-33 (2010)
Article DOI: 10.1021/jm901269y
BindingDB Entry DOI: 10.7270/Q25X291D