null
SMILES: COc1ccc(cc1OC)C(=O)NCc1cccc(c1)C(=O)NCC1CCCO1
InChI Key: InChIKey=FJJVLVZVEKFRNJ-UHFFFAOYSA-N
Activity Spreadsheet -- Enzyme Inhibition Constant Data from BindingDB
Found 1 hit for monomerid = 50308879
Trg + Lig
Ki
nM
ΔG°
kcal/mole
IC50
nM
Kd
nM
EC50/IC50
nM
koff
s-1
kon
M-1s-1
pHTemp
°C
Rho-associated protein kinase 2
(Homo sapiens (Human))
BDBM50308879
(CHEMBL597522 | rac-3,4-dimethoxy-N-(3-((tetrahydro...)
Show SMILES COc1ccc(cc1OC)C(=O)NCc1cccc(c1)C(=O)NCC1CCCO1
Show InChI InChI=1S/C22H26N2O5/c1-27-19-9-8-17(12-20(19)28-2)22(26)23-13-15-5-3-6-16(11-15)21(25)24-14-18-7-4-10-29-18/h3,5-6,8-9,11-12,18H,4,7,10,13-14H2,1-2H3,(H,23,26)(H,24,25)
n/an/a 1.20E+3n/an/an/an/an/an/a
Boehringer Ingelheim Pharmaceuticals
Curated by ChEMBL
Assay Description
Inhibition of human ROCK2 by IMAP assay
J Med Chem 53: 759-77 (2010)
Article DOI: 10.1021/jm9014263
BindingDB Entry DOI: 10.7270/Q2V125RD