null
SMILES: COc1ccc(cc1OC)C(=O)NCc1cccc(c1)C(=O)Nc1ccc2cnccc2c1
InChI Key: InChIKey=FQPWBYFCQBWTRI-UHFFFAOYSA-N
Activity Spreadsheet -- Enzyme Inhibition Constant Data from BindingDB
Found 1 hit for monomerid = 50308891
Trg + Lig
Ki
nM
ΔG°
kcal/mole
IC50
nM
Kd
nM
EC50/IC50
nM
koff
s-1
kon
M-1s-1
pHTemp
°C
Rho-associated protein kinase 2
(Homo sapiens (Human))
BDBM50308891
(CHEMBL597734 | N-[3-(Isoquinolin-6-ylcarbamoyl)-be...)
Show SMILES COc1ccc(cc1OC)C(=O)NCc1cccc(c1)C(=O)Nc1ccc2cnccc2c1
Show InChI InChI=1S/C26H23N3O4/c1-32-23-9-7-20(14-24(23)33-2)25(30)28-15-17-4-3-5-19(12-17)26(31)29-22-8-6-21-16-27-11-10-18(21)13-22/h3-14,16H,15H2,1-2H3,(H,28,30)(H,29,31)
n/an/a 6.85E+5n/an/an/an/an/an/a
Boehringer Ingelheim Pharmaceuticals
Curated by ChEMBL
Assay Description
Inhibition of human ROCK2 by IMAP assay
J Med Chem 53: 759-77 (2010)
Article DOI: 10.1021/jm9014263
BindingDB Entry DOI: 10.7270/Q2V125RD