BDBM50309221 6,7-dichloro-4-(4-fluoro-3-(1,8-diazaspiro[4.5]decane-8-carbonyl)benzyl)pyrrolo[1,2-a]pyrazin-1(2H)-one::CHEMBL606029
SMILES: Fc1ccc(Cc2c[nH]c(=O)c3cc(Cl)c(Cl)n23)cc1C(=O)N1CCC2(CCCN2)CC1
InChI Key: InChIKey=HATHVQLHSBBXIA-UHFFFAOYSA-N
Data: 4 IC50
Activity Spreadsheet -- Enzyme Inhibition Constant Data from BindingDB
Found 4 hits for monomerid = 50309221
Trg + Lig
Ki
nM
ΔG°
kcal/mole
IC50
nM
Kd
nM
EC50/IC50
nM
koff
s-1
kon
M-1s-1
pHTemp
°C
Poly [ADP-ribose] polymerase 1
(Homo sapiens (Human))
BDBM50309221
(6,7-dichloro-4-(4-fluoro-3-(1,8-diazaspiro[4.5]dec...)
Show SMILES Fc1ccc(Cc2c[nH]c(=O)c3cc(Cl)c(Cl)n23)cc1C(=O)N1CCC2(CCCN2)CC1
Show InChI InChI=1S/C23H23Cl2FN4O2/c24-17-12-19-21(31)27-13-15(30(19)20(17)25)10-14-2-3-18(26)16(11-14)22(32)29-8-5-23(6-9-29)4-1-7-28-23/h2-3,11-13,28H,1,4-10H2,(H,27,31)
n/an/a 2.5n/an/an/an/an/an/a
Merck Research Laboratories Rome
Curated by ChEMBL
Assay Description
Inhibition of PARP1
Bioorg Med Chem Lett 20: 1100-5 (2010)
Article DOI: 10.1016/j.bmcl.2009.11.087
BindingDB Entry DOI: 10.7270/Q2Z89CJ6
Potassium voltage-gated channel subfamily H member 2
(Homo sapiens (Human))
BDBM50309221
(6,7-dichloro-4-(4-fluoro-3-(1,8-diazaspiro[4.5]dec...)
Show SMILES Fc1ccc(Cc2c[nH]c(=O)c3cc(Cl)c(Cl)n23)cc1C(=O)N1CCC2(CCCN2)CC1
Show InChI InChI=1S/C23H23Cl2FN4O2/c24-17-12-19-21(31)27-13-15(30(19)20(17)25)10-14-2-3-18(26)16(11-14)22(32)29-8-5-23(6-9-29)4-1-7-28-23/h2-3,11-13,28H,1,4-10H2,(H,27,31)
Reactome pathway
n/an/a 1.20E+4n/an/an/an/an/an/a
Merck Research Laboratories Rome
Curated by ChEMBL
Assay Description
Inhibition of human ERG
Bioorg Med Chem Lett 20: 1100-5 (2010)
Article DOI: 10.1016/j.bmcl.2009.11.087
BindingDB Entry DOI: 10.7270/Q2Z89CJ6
Potassium voltage-gated channel subfamily H member 2
(Homo sapiens (Human))
BDBM50309221
(6,7-dichloro-4-(4-fluoro-3-(1,8-diazaspiro[4.5]dec...)
Show SMILES Fc1ccc(Cc2c[nH]c(=O)c3cc(Cl)c(Cl)n23)cc1C(=O)N1CCC2(CCCN2)CC1
Show InChI InChI=1S/C23H23Cl2FN4O2/c24-17-12-19-21(31)27-13-15(30(19)20(17)25)10-14-2-3-18(26)16(11-14)22(32)29-8-5-23(6-9-29)4-1-7-28-23/h2-3,11-13,28H,1,4-10H2,(H,27,31)
Reactome pathway
n/an/a 1.20E+4n/an/an/an/an/an/a
IRBM/Merck Research Laboratories
Curated by ChEMBL
Assay Description
Inhibition of human ERG
Bioorg Med Chem Lett 20: 1094-9 (2010)
Article DOI: 10.1016/j.bmcl.2009.12.026
BindingDB Entry DOI: 10.7270/Q2FB531P
Poly [ADP-ribose] polymerase 1
(Homo sapiens (Human))
BDBM50309221
(6,7-dichloro-4-(4-fluoro-3-(1,8-diazaspiro[4.5]dec...)
Show SMILES Fc1ccc(Cc2c[nH]c(=O)c3cc(Cl)c(Cl)n23)cc1C(=O)N1CCC2(CCCN2)CC1
Show InChI InChI=1S/C23H23Cl2FN4O2/c24-17-12-19-21(31)27-13-15(30(19)20(17)25)10-14-2-3-18(26)16(11-14)22(32)29-8-5-23(6-9-29)4-1-7-28-23/h2-3,11-13,28H,1,4-10H2,(H,27,31)
n/an/a 2.5n/an/an/an/an/an/a
IRBM/Merck Research Laboratories
Curated by ChEMBL
Assay Description
Inhibition of PARP1 by topcount microplate scintillation counter
Bioorg Med Chem Lett 20: 1094-9 (2010)
Article DOI: 10.1016/j.bmcl.2009.12.026
BindingDB Entry DOI: 10.7270/Q2FB531P