BDBM50309230 6-(4-fluoro-3-(4-(1-(methylamino)cyclopropanecarbonyl)piperazine-1-carbonyl)benzyl)-4,5-dimethylpyridazin-3(2H)-one::CHEMBL599803
SMILES: CNC1(CC1)C(=O)N1CCN(CC1)C(=O)c1cc(Cc2n[nH]c(=O)c(C)c2C)ccc1F
InChI Key: InChIKey=WZMSGQTWOHGSMQ-UHFFFAOYSA-N
Data: 1 IC50
Activity Spreadsheet -- Enzyme Inhibition Constant Data from BindingDB
Found 1 hit for monomerid = 50309230
Trg + Lig
Ki
nM
ΔG°
kcal/mole
IC50
nM
Kd
nM
EC50/IC50
nM
koff
s-1
kon
M-1s-1
pHTemp
°C
Poly [ADP-ribose] polymerase 1
(Homo sapiens (Human))
BDBM50309230
(6-(4-fluoro-3-(4-(1-(methylamino)cyclopropanecarbo...)
Show SMILES CNC1(CC1)C(=O)N1CCN(CC1)C(=O)c1cc(Cc2n[nH]c(=O)c(C)c2C)ccc1F
Show InChI InChI=1S/C23H28FN5O3/c1-14-15(2)20(30)27-26-19(14)13-16-4-5-18(24)17(12-16)21(31)28-8-10-29(11-9-28)22(32)23(25-3)6-7-23/h4-5,12,25H,6-11,13H2,1-3H3,(H,27,30)
n/an/a 3.60n/an/an/an/an/an/a
Merck Research Laboratories Rome
Curated by ChEMBL
Assay Description
Inhibition of PARP1
Bioorg Med Chem Lett 20: 1100-5 (2010)
Article DOI: 10.1016/j.bmcl.2009.11.087
BindingDB Entry DOI: 10.7270/Q2Z89CJ6