BDBM50309239 6-(4-fluoro-3-(4-(2-methylpyrrolidine-2-carbonyl)piperazine-1-carbonyl)benzyl)-4,5-dimethylpyridazin-3(2H)-one::CHEMBL605552
SMILES: Cc1c(C)c(=O)[nH]nc1Cc1ccc(F)c(c1)C(=O)N1CCN(CC1)C(=O)C1(C)CCCN1
InChI Key: InChIKey=NLDJQNDOIRHNPD-UHFFFAOYSA-N
Data: 1 IC50
Activity Spreadsheet -- Enzyme Inhibition Constant Data from BindingDB
Found 1 hit for monomerid = 50309239
Trg + Lig
Ki
nM
ΔG°
kcal/mole
IC50
nM
Kd
nM
EC50/IC50
nM
koff
s-1
kon
M-1s-1
pHTemp
°C
Poly [ADP-ribose] polymerase 1
(Homo sapiens (Human))
BDBM50309239
(6-(4-fluoro-3-(4-(2-methylpyrrolidine-2-carbonyl)p...)
Show SMILES Cc1c(C)c(=O)[nH]nc1Cc1ccc(F)c(c1)C(=O)N1CCN(CC1)C(=O)C1(C)CCCN1
Show InChI InChI=1S/C24H30FN5O3/c1-15-16(2)21(31)28-27-20(15)14-17-5-6-19(25)18(13-17)22(32)29-9-11-30(12-10-29)23(33)24(3)7-4-8-26-24/h5-6,13,26H,4,7-12,14H2,1-3H3,(H,28,31)
n/an/a 2.80n/an/an/an/an/an/a
Merck Research Laboratories Rome
Curated by ChEMBL
Assay Description
Inhibition of PARP1
Bioorg Med Chem Lett 20: 1100-5 (2010)
Article DOI: 10.1016/j.bmcl.2009.11.087
BindingDB Entry DOI: 10.7270/Q2Z89CJ6