BDBM50309392 4-(3-(1,4-diazepane-1-carbonyl)-4-fluorobenzyl)-6,7-dichloropyrrolo[1,2-a]pyrazin-1(2H)-one::CHEMBL596933
SMILES: Fc1ccc(Cc2c[nH]c(=O)c3cc(Cl)c(Cl)n23)cc1C(=O)N1CCCNCC1
InChI Key: InChIKey=GPIBUHIRGWDJRU-UHFFFAOYSA-N
Data: 1 IC50
Activity Spreadsheet -- Enzyme Inhibition Constant Data from BindingDB
Found 1 hit for monomerid = 50309392
Trg + Lig
Ki
nM
ΔG°
kcal/mole
IC50
nM
Kd
nM
EC50/IC50
nM
koff
s-1
kon
M-1s-1
pHTemp
°C
Poly [ADP-ribose] polymerase 1
(Homo sapiens (Human))
BDBM50309392
(4-(3-(1,4-diazepane-1-carbonyl)-4-fluorobenzyl)-6,...)
Show SMILES Fc1ccc(Cc2c[nH]c(=O)c3cc(Cl)c(Cl)n23)cc1C(=O)N1CCCNCC1
Show InChI InChI=1S/C20H19Cl2FN4O2/c21-15-10-17-19(28)25-11-13(27(17)18(15)22)8-12-2-3-16(23)14(9-12)20(29)26-6-1-4-24-5-7-26/h2-3,9-11,24H,1,4-8H2,(H,25,28)
n/an/a 2.60n/an/an/an/an/an/a
IRBM/Merck Research Laboratories
Curated by ChEMBL
Assay Description
Inhibition of PARP1 by topcount microplate scintillation counter
Bioorg Med Chem Lett 20: 1094-9 (2010)
Article DOI: 10.1016/j.bmcl.2009.12.026
BindingDB Entry DOI: 10.7270/Q2FB531P