null
SMILES: COc1cc2CCN3CC(C(N)CC3c2cc1OC)N1CCC(C)CC1=O
InChI Key: InChIKey=WVBKPWPUNZOWNG-UHFFFAOYSA-N
Activity Spreadsheet -- Enzyme Inhibition Constant Data from BindingDB
Found 1 hit for monomerid = 50309462
Trg + Lig
Ki
nM
ΔG°
kcal/mole
IC50
nM
Kd
nM
EC50/IC50
nM
koff
s-1
kon
M-1s-1
pHTemp
°C
Dipeptidyl peptidase 4
(Homo sapiens (Human))
BDBM50309462
((SR, SR, SR)-1-(2-amino-9,10-dimethoxy-2,3,4,6,7,1...)
Show SMILES COc1cc2CCN3CC(C(N)CC3c2cc1OC)N1CCC(C)CC1=O
Show InChI InChI=1S/C21H31N3O3/c1-13-4-7-24(21(25)8-13)18-12-23-6-5-14-9-19(26-2)20(27-3)10-15(14)17(23)11-16(18)22/h9-10,13,16-18H,4-8,11-12,22H2,1-3H3
Reactome pathway
n/an/a 19n/an/an/an/an/an/a
F Hoffmann-La Roche Ltd
Curated by ChEMBL
Assay Description
Inhibition of human DPP4
Bioorg Med Chem Lett 20: 1109-13 (2010)
Checked by Author
Article DOI: 10.1016/j.bmcl.2009.12.024
BindingDB Entry DOI: 10.7270/Q2222TW8