BDBM50309707 4-fluorobenzaldehyde O-4-butoxyphenylcarbamoyl oxime::CHEMBL598046
SMILES: CCCCOc1ccc(NC(=O)O\N=C\c2ccc(F)cc2)cc1
InChI Key: InChIKey=TUBGAHMSUYZNEG-DEDYPNTBSA-N
Data: 1 KI  1 IC50
Activity Spreadsheet -- Enzyme Inhibition Constant Data from BindingDB
Found 2 hits for monomerid = 50309707
Trg + Lig
Ki
nM
ΔG°
kcal/mole
IC50
nM
Kd
nM
EC50/IC50
nM
koff
s-1
kon
M-1s-1
pHTemp
°C
Fatty-acid amide hydrolase 1
(Homo sapiens (Human))
BDBM50309707
(4-fluorobenzaldehyde O-4-butoxyphenylcarbamoyl oxi...)
Show SMILES CCCCOc1ccc(NC(=O)O\N=C\c2ccc(F)cc2)cc1
Show InChI InChI=1S/C18H19FN2O3/c1-2-3-12-23-17-10-8-16(9-11-17)21-18(22)24-20-13-14-4-6-15(19)7-5-14/h4-11,13H,2-3,12H2,1H3,(H,21,22)/b20-13+
30n/an/an/an/an/an/an/an/a
Bristol-Myers Squibb Research& Development
Curated by ChEMBL
Assay Description
Competitive inhibition of human FAAH expressed in human H4 cells
Bioorg Med Chem Lett 20: 1272-7 (2010)
Article DOI: 10.1016/j.bmcl.2009.11.080
BindingDB Entry DOI: 10.7270/Q2H41RKR
Fatty-acid amide hydrolase 1
(Homo sapiens (Human))
BDBM50309707
(4-fluorobenzaldehyde O-4-butoxyphenylcarbamoyl oxi...)
Show SMILES CCCCOc1ccc(NC(=O)O\N=C\c2ccc(F)cc2)cc1
Show InChI InChI=1S/C18H19FN2O3/c1-2-3-12-23-17-10-8-16(9-11-17)21-18(22)24-20-13-14-4-6-15(19)7-5-14/h4-11,13H,2-3,12H2,1H3,(H,21,22)/b20-13+
n/an/a 2.20n/an/an/an/an/an/a
Bristol-Myers Squibb Research& Development
Curated by ChEMBL
Assay Description
Inhibition of human FAAH expressed in human H4 cells
Bioorg Med Chem Lett 20: 1272-7 (2010)
Article DOI: 10.1016/j.bmcl.2009.11.080
BindingDB Entry DOI: 10.7270/Q2H41RKR