BDBM50309708 4-fluorobenzaldehyde O-4-(pentyloxy)phenylcarbamoyl oxime::CHEMBL598047
SMILES: CCCCCOc1ccc(NC(=O)O\N=C\c2ccc(F)cc2)cc1
InChI Key: InChIKey=IGOHEYVUSMLPPS-KGENOOAVSA-N
Data: 1 IC50
Activity Spreadsheet -- Enzyme Inhibition Constant Data from BindingDB
Found 1 hit for monomerid = 50309708
Trg + Lig
Ki
nM
ΔG°
kcal/mole
IC50
nM
Kd
nM
EC50/IC50
nM
koff
s-1
kon
M-1s-1
pHTemp
°C
Fatty-acid amide hydrolase 1
(Homo sapiens (Human))
BDBM50309708
(4-fluorobenzaldehyde O-4-(pentyloxy)phenylcarbamoy...)
Show SMILES CCCCCOc1ccc(NC(=O)O\N=C\c2ccc(F)cc2)cc1
Show InChI InChI=1S/C19H21FN2O3/c1-2-3-4-13-24-18-11-9-17(10-12-18)22-19(23)25-21-14-15-5-7-16(20)8-6-15/h5-12,14H,2-4,13H2,1H3,(H,22,23)/b21-14+
n/an/a 1.80n/an/an/an/an/an/a
Bristol-Myers Squibb Research& Development
Curated by ChEMBL
Assay Description
Inhibition of human FAAH expressed in human H4 cells
Bioorg Med Chem Lett 20: 1272-7 (2010)
Article DOI: 10.1016/j.bmcl.2009.11.080
BindingDB Entry DOI: 10.7270/Q2H41RKR