BDBM50309744 2-fluorophenyl 1-(4-butoxyphenyl)propylcarbamate::CHEMBL597030
SMILES: CCCCOc1ccc(cc1)C(CC)NC(=O)Oc1ccccc1F
InChI Key: InChIKey=GDLJXVIFSNBWKP-UHFFFAOYSA-N
Data: 1 IC50
Activity Spreadsheet -- Enzyme Inhibition Constant Data from BindingDB
Found 1 hit for monomerid = 50309744
Trg + Lig
Ki
nM
ΔG°
kcal/mole
IC50
nM
Kd
nM
EC50/IC50
nM
koff
s-1
kon
M-1s-1
pHTemp
°C
Fatty-acid amide hydrolase 1
(Homo sapiens (Human))
BDBM50309744
(2-fluorophenyl 1-(4-butoxyphenyl)propylcarbamate |...)
Show SMILES CCCCOc1ccc(cc1)C(CC)NC(=O)Oc1ccccc1F
Show InChI InChI=1S/C20H24FNO3/c1-3-5-14-24-16-12-10-15(11-13-16)18(4-2)22-20(23)25-19-9-7-6-8-17(19)21/h6-13,18H,3-5,14H2,1-2H3,(H,22,23)
n/an/a 7.70n/an/an/an/an/an/a
Bristol-Myers Squibb Research& Development
Curated by ChEMBL
Assay Description
Inhibition of human FAAH expressed in human H4 cells
Bioorg Med Chem Lett 20: 1272-7 (2010)
Article DOI: 10.1016/j.bmcl.2009.11.080
BindingDB Entry DOI: 10.7270/Q2H41RKR