BDBM50309879 2-(6-Chlorooxazolo[5,4-b]pyridin-2-yl)-2,5-diazabicyclo[3.2.2]-nonane::CHEMBL597276
SMILES: Clc1cnc2oc(nc2c1)N1CCN2CCC1CC2
InChI Key: InChIKey=KZCFXYPUJPOLMF-UHFFFAOYSA-N
Data: 1 KI  1 IC50
Activity Spreadsheet -- Enzyme Inhibition Constant Data from BindingDB
Found 2 hits for monomerid = 50309879
Trg + Lig
Ki
nM
ΔG°
kcal/mole
IC50
nM
Kd
nM
EC50/IC50
nM
koff
s-1
kon
M-1s-1
pHTemp
°C
Neuronal acetylcholine receptor
(Rattus norvegicus (Rat))
BDBM50309879
(2-(6-Chlorooxazolo[5,4-b]pyridin-2-yl)-2,5-diazabi...)
Show SMILES Clc1cnc2oc(nc2c1)N1CCN2CCC1CC2 |TLB:6:10:15.14:17.18,(32.86,-26.98,;31.33,-27.22,;30.35,-26.01,;28.83,-26.25,;28.27,-27.69,;26.83,-28.23,;26.89,-29.77,;28.39,-30.18,;29.24,-28.9,;30.77,-28.66,;25.56,-30.54,;25.93,-32.01,;24.92,-31.29,;23.55,-31.36,;23.47,-29.65,;24.09,-28.51,;24.15,-29.92,;22.85,-30.62,;22.55,-32.06,)|
Show InChI InChI=1S/C13H15ClN4O/c14-9-7-11-12(15-8-9)19-13(16-11)18-6-5-17-3-1-10(18)2-4-17/h7-8,10H,1-6H2
Reactome pathway
2.59n/an/an/an/an/an/an/an/a
Pfizer Global Research and Development
Curated by ChEMBL
Assay Description
Displacement of [125I]BTX from rat alpha7 nicotinic acetylcholine receptor expressed in GH4C1 cells
J Med Chem 53: 1222-37 (2010)
Article DOI: 10.1021/jm9015075
BindingDB Entry DOI: 10.7270/Q2QN66W3
Potassium voltage-gated channel subfamily H member 2
(Homo sapiens (Human))
BDBM50309879
(2-(6-Chlorooxazolo[5,4-b]pyridin-2-yl)-2,5-diazabi...)
Show SMILES Clc1cnc2oc(nc2c1)N1CCN2CCC1CC2 |TLB:6:10:15.14:17.18,(32.86,-26.98,;31.33,-27.22,;30.35,-26.01,;28.83,-26.25,;28.27,-27.69,;26.83,-28.23,;26.89,-29.77,;28.39,-30.18,;29.24,-28.9,;30.77,-28.66,;25.56,-30.54,;25.93,-32.01,;24.92,-31.29,;23.55,-31.36,;23.47,-29.65,;24.09,-28.51,;24.15,-29.92,;22.85,-30.62,;22.55,-32.06,)|
Show InChI InChI=1S/C13H15ClN4O/c14-9-7-11-12(15-8-9)19-13(16-11)18-6-5-17-3-1-10(18)2-4-17/h7-8,10H,1-6H2
Reactome pathway
n/an/a 2.20E+3n/an/an/an/an/an/a
Pfizer Global Research and Development
Curated by ChEMBL
Assay Description
Inhibition of human ERG
J Med Chem 53: 1222-37 (2010)
Article DOI: 10.1021/jm9015075
BindingDB Entry DOI: 10.7270/Q2QN66W3