BDBM50309955 (exo)-N-(3-(cyclopentyloxy)-4-methoxybenzyl)-1-methyl-N-(octahydrocyclopenta[c]pyrrol-5-yl)-1H-imidazole-4-carboxamide::CHEMBL603893
SMILES: COc1ccc(CN([C@@H]2C[C@@H]3CNC[C@@H]3C2)C(=O)c2cn(C)cn2)cc1OC1CCCC1
InChI Key: InChIKey=CRMAUZQHGCAUDQ-ACDBMABISA-N
Data: 1 KI  2 IC50
Activity Spreadsheet -- Enzyme Inhibition Constant Data from BindingDB
Found 3 hits for monomerid = 50309955
Trg + Lig
Ki
nM
ΔG°
kcal/mole
IC50
nM
Kd
nM
EC50/IC50
nM
koff
s-1
kon
M-1s-1
pHTemp
°C
Glycine transporter 1
(Homo sapiens (Human))
BDBM50309955
((exo)-N-(3-(cyclopentyloxy)-4-methoxybenzyl)-1-met...)
Show SMILES COc1ccc(CN([C@@H]2C[C@@H]3CNC[C@@H]3C2)C(=O)c2cn(C)cn2)cc1OC1CCCC1 |r|
Show InChI InChI=1S/C25H34N4O3/c1-28-15-22(27-16-28)25(30)29(20-10-18-12-26-13-19(18)11-20)14-17-7-8-23(31-2)24(9-17)32-21-5-3-4-6-21/h7-9,15-16,18-21,26H,3-6,10-14H2,1-2H3/t18-,19+,20-
>641n/an/an/an/an/an/an/an/a
Pfizer Global Research& Development
Curated by ChEMBL
Assay Description
Displacement of tritiated NPTS from human glycine transporter 1 expressed in HEK293 cells
Bioorg Med Chem Lett 20: 907-11 (2010)
Article DOI: 10.1016/j.bmcl.2009.12.071
BindingDB Entry DOI: 10.7270/Q2Z31ZR5
Cytochrome P450 3A4
(Homo sapiens (Human))
BDBM50309955
((exo)-N-(3-(cyclopentyloxy)-4-methoxybenzyl)-1-met...)
Show SMILES COc1ccc(CN([C@@H]2C[C@@H]3CNC[C@@H]3C2)C(=O)c2cn(C)cn2)cc1OC1CCCC1 |r|
Show InChI InChI=1S/C25H34N4O3/c1-28-15-22(27-16-28)25(30)29(20-10-18-12-26-13-19(18)11-20)14-17-7-8-23(31-2)24(9-17)32-21-5-3-4-6-21/h7-9,15-16,18-21,26H,3-6,10-14H2,1-2H3/t18-,19+,20-
Reactome pathway
n/an/a>1.00E+4n/an/an/an/an/an/a
Pfizer Global Research& Development
Curated by ChEMBL
Assay Description
Inhibition of CYP3A4
Bioorg Med Chem Lett 20: 907-11 (2010)
Article DOI: 10.1016/j.bmcl.2009.12.071
BindingDB Entry DOI: 10.7270/Q2Z31ZR5
Cytochrome P450 2D6
(Homo sapiens (Human))
BDBM50309955
((exo)-N-(3-(cyclopentyloxy)-4-methoxybenzyl)-1-met...)
Show SMILES COc1ccc(CN([C@@H]2C[C@@H]3CNC[C@@H]3C2)C(=O)c2cn(C)cn2)cc1OC1CCCC1 |r|
Show InChI InChI=1S/C25H34N4O3/c1-28-15-22(27-16-28)25(30)29(20-10-18-12-26-13-19(18)11-20)14-17-7-8-23(31-2)24(9-17)32-21-5-3-4-6-21/h7-9,15-16,18-21,26H,3-6,10-14H2,1-2H3/t18-,19+,20-
n/an/a>1.00E+4n/an/an/an/an/an/a
Pfizer Global Research& Development
Curated by ChEMBL
Assay Description
Inhibition of CYP2D6
Bioorg Med Chem Lett 20: 907-11 (2010)
Article DOI: 10.1016/j.bmcl.2009.12.071
BindingDB Entry DOI: 10.7270/Q2Z31ZR5