BDBM50309957 (exo)-N-(3-isopropoxybenzyl)-1-methyl-N-(octahydrocyclopenta[c]pyrrol-5-yl)-1H-imidazole-4-carboxamide::CHEMBL599264
SMILES: CC(C)Oc1cccc(CN([C@@H]2C[C@@H]3CNC[C@@H]3C2)C(=O)c2cn(C)cn2)c1
InChI Key: InChIKey=UTNWHVZSHUCJTA-REPLKXPHSA-N
Data: 1 KI  3 IC50
Activity Spreadsheet -- Enzyme Inhibition Constant Data from BindingDB
Found 4 hits for monomerid = 50309957
Trg + Lig
Ki
nM
ΔG°
kcal/mole
IC50
nM
Kd
nM
EC50/IC50
nM
koff
s-1
kon
M-1s-1
pHTemp
°C
Glycine transporter 1
(Homo sapiens (Human))
BDBM50309957
((exo)-N-(3-isopropoxybenzyl)-1-methyl-N-(octahydro...)
Show SMILES CC(C)Oc1cccc(CN([C@@H]2C[C@@H]3CNC[C@@H]3C2)C(=O)c2cn(C)cn2)c1 |r|
Show InChI InChI=1S/C22H30N4O2/c1-15(2)28-20-6-4-5-16(7-20)12-26(22(27)21-13-25(3)14-24-21)19-8-17-10-23-11-18(17)9-19/h4-7,13-15,17-19,23H,8-12H2,1-3H3/t17-,18+,19-
4n/an/an/an/an/an/an/an/a
Pfizer Global Research& Development
Curated by ChEMBL
Assay Description
Displacement of tritiated NPTS from human glycine transporter 1 expressed in HEK293 cells
Bioorg Med Chem Lett 20: 907-11 (2010)
Article DOI: 10.1016/j.bmcl.2009.12.071
BindingDB Entry DOI: 10.7270/Q2Z31ZR5
Cytochrome P450 2D6
(Homo sapiens (Human))
BDBM50309957
((exo)-N-(3-isopropoxybenzyl)-1-methyl-N-(octahydro...)
Show SMILES CC(C)Oc1cccc(CN([C@@H]2C[C@@H]3CNC[C@@H]3C2)C(=O)c2cn(C)cn2)c1 |r|
Show InChI InChI=1S/C22H30N4O2/c1-15(2)28-20-6-4-5-16(7-20)12-26(22(27)21-13-25(3)14-24-21)19-8-17-10-23-11-18(17)9-19/h4-7,13-15,17-19,23H,8-12H2,1-3H3/t17-,18+,19-
n/an/a>1.00E+4n/an/an/an/an/an/a
Pfizer Global Research& Development
Curated by ChEMBL
Assay Description
Inhibition of CYP2D6
Bioorg Med Chem Lett 20: 907-11 (2010)
Article DOI: 10.1016/j.bmcl.2009.12.071
BindingDB Entry DOI: 10.7270/Q2Z31ZR5
Cytochrome P450 3A4
(Homo sapiens (Human))
BDBM50309957
((exo)-N-(3-isopropoxybenzyl)-1-methyl-N-(octahydro...)
Show SMILES CC(C)Oc1cccc(CN([C@@H]2C[C@@H]3CNC[C@@H]3C2)C(=O)c2cn(C)cn2)c1 |r|
Show InChI InChI=1S/C22H30N4O2/c1-15(2)28-20-6-4-5-16(7-20)12-26(22(27)21-13-25(3)14-24-21)19-8-17-10-23-11-18(17)9-19/h4-7,13-15,17-19,23H,8-12H2,1-3H3/t17-,18+,19-
Reactome pathway
n/an/a>1.00E+4n/an/an/an/an/an/a
Pfizer Global Research& Development
Curated by ChEMBL
Assay Description
Inhibition of CYP3A4
Bioorg Med Chem Lett 20: 907-11 (2010)
Article DOI: 10.1016/j.bmcl.2009.12.071
BindingDB Entry DOI: 10.7270/Q2Z31ZR5
Glycine transporter 2
(Homo sapiens (Human))
BDBM50309957
((exo)-N-(3-isopropoxybenzyl)-1-methyl-N-(octahydro...)
Show SMILES CC(C)Oc1cccc(CN([C@@H]2C[C@@H]3CNC[C@@H]3C2)C(=O)c2cn(C)cn2)c1 |r|
Show InChI InChI=1S/C22H30N4O2/c1-15(2)28-20-6-4-5-16(7-20)12-26(22(27)21-13-25(3)14-24-21)19-8-17-10-23-11-18(17)9-19/h4-7,13-15,17-19,23H,8-12H2,1-3H3/t17-,18+,19-
Reactome pathway
n/an/a 2.21E+3n/an/an/an/an/an/a
Pfizer Global Research& Development
Curated by ChEMBL
Assay Description
Inhibition of human glycine transporter 2-mediated glycine uptake expressed in HEK293 cells
Bioorg Med Chem Lett 20: 907-11 (2010)
Article DOI: 10.1016/j.bmcl.2009.12.071
BindingDB Entry DOI: 10.7270/Q2Z31ZR5