BDBM50310030 4-((1H-1,2,4-Triazol-1-yl)methyl)-5-(4-bromophenyl)-1-(2-chlorophenyl)-N-(1-cyanocyclopropyl)-1H-pyrazole-3-carboxamide::CHEMBL599062
SMILES: Clc1ccccc1-n1nc(C(=O)NC2(CC2)C#N)c(Cn2cncn2)c1-c1ccc(Br)cc1
InChI Key: InChIKey=YWPPSSYPMDECLE-UHFFFAOYSA-N
Data: 1 IC50
Activity Spreadsheet -- Enzyme Inhibition Constant Data from BindingDB
Found 1 hit for monomerid = 50310030
Trg + Lig
Ki
nM
ΔG°
kcal/mole
IC50
nM
Kd
nM
EC50/IC50
nM
koff
s-1
kon
M-1s-1
pHTemp
°C
Cannabinoid receptor 1
(Rattus norvegicus (rat))
BDBM50310030
(4-((1H-1,2,4-Triazol-1-yl)methyl)-5-(4-bromophenyl...)
Show SMILES Clc1ccccc1-n1nc(C(=O)NC2(CC2)C#N)c(Cn2cncn2)c1-c1ccc(Br)cc1
Show InChI InChI=1S/C23H17BrClN7O/c24-16-7-5-15(6-8-16)21-17(11-31-14-27-13-28-31)20(22(33)29-23(12-26)9-10-23)30-32(21)19-4-2-1-3-18(19)25/h1-8,13-14H,9-11H2,(H,29,33)
Reactome pathway
n/an/a 19.6n/an/an/an/an/an/a
Green Cross Corporation
Curated by ChEMBL
Assay Description
Displacement of [3H]CP55,940 from CB1 receptor in Sprague-Dawley rat cerebellar membrane
Bioorg Med Chem 18: 1149-62 (2010)
Article DOI: 10.1016/j.bmc.2009.12.040
BindingDB Entry DOI: 10.7270/Q2TD9XG2