BDBM50310051 4-((1H-1,2,4-Triazol-1-yl)methyl)-5-(4-bromophenyl)-N-cycloheptyl-1-(2,4-dichlorophenyl)-1H-pyrazole-3-carboxamide::CHEMBL603240
SMILES: Clc1ccc(c(Cl)c1)-n1nc(C(=O)NC2CCCCCC2)c(Cn2cncn2)c1-c1ccc(Br)cc1
InChI Key: InChIKey=QIYGRZKUFBYLJF-UHFFFAOYSA-N
Data: 1 IC50
Activity Spreadsheet -- Enzyme Inhibition Constant Data from BindingDB
Found 1 hit for monomerid = 50310051
Trg + Lig
Ki
nM
ΔG°
kcal/mole
IC50
nM
Kd
nM
EC50/IC50
nM
koff
s-1
kon
M-1s-1
pHTemp
°C
Cannabinoid receptor 1
(Rattus norvegicus (rat))
BDBM50310051
(4-((1H-1,2,4-Triazol-1-yl)methyl)-5-(4-bromophenyl...)
Show SMILES Clc1ccc(c(Cl)c1)-n1nc(C(=O)NC2CCCCCC2)c(Cn2cncn2)c1-c1ccc(Br)cc1
Show InChI InChI=1S/C26H25BrCl2N6O/c27-18-9-7-17(8-10-18)25-21(14-34-16-30-15-31-34)24(26(36)32-20-5-3-1-2-4-6-20)33-35(25)23-12-11-19(28)13-22(23)29/h7-13,15-16,20H,1-6,14H2,(H,32,36)
Reactome pathway
n/an/a 8.49n/an/an/an/an/an/a
Green Cross Corporation
Curated by ChEMBL
Assay Description
Displacement of [3H]CP55,940 from CB1 receptor in Sprague-Dawley rat cerebellar membrane
Bioorg Med Chem 18: 1149-62 (2010)
Article DOI: 10.1016/j.bmc.2009.12.040
BindingDB Entry DOI: 10.7270/Q2TD9XG2