BDBM50310068 4-((1H-1,2,4-Triazol-1-yl)methyl)-5-(4-chlorophenyl)-1-(2,4-dichlorophenyl)-N-(2-ethylhexyl)-1H-pyrazole-3-carboxamide::CHEMBL598775
SMILES: CCC1CCCCC1NC(=O)c1nn(c(c1Cn1cncn1)-c1ccc(Cl)cc1)-c1ccc(Cl)cc1Cl
InChI Key: InChIKey=RKWXBXQGOIHETC-UHFFFAOYSA-N
Data: 1 IC50
Activity Spreadsheet -- Enzyme Inhibition Constant Data from BindingDB
Found 1 hit for monomerid = 50310068
Trg + Lig
Ki
nM
ΔG°
kcal/mole
IC50
nM
Kd
nM
EC50/IC50
nM
koff
s-1
kon
M-1s-1
pHTemp
°C
Cannabinoid receptor 1
(Rattus norvegicus (rat))
BDBM50310068
(4-((1H-1,2,4-Triazol-1-yl)methyl)-5-(4-chloropheny...)
Show SMILES CCC1CCCCC1NC(=O)c1nn(c(c1Cn1cncn1)-c1ccc(Cl)cc1)-c1ccc(Cl)cc1Cl
Show InChI InChI=1S/C27H27Cl3N6O/c1-2-17-5-3-4-6-23(17)33-27(37)25-21(14-35-16-31-15-32-35)26(18-7-9-19(28)10-8-18)36(34-25)24-12-11-20(29)13-22(24)30/h7-13,15-17,23H,2-6,14H2,1H3,(H,33,37)
Reactome pathway
n/an/a 20.2n/an/an/an/an/an/a
Green Cross Corporation
Curated by ChEMBL
Assay Description
Displacement of [3H]CP55,940 from CB1 receptor in Sprague-Dawley rat cerebellar membrane
Bioorg Med Chem 18: 1149-62 (2010)
Article DOI: 10.1016/j.bmc.2009.12.040
BindingDB Entry DOI: 10.7270/Q2TD9XG2