BDBM50310095 (7-(methylcarbamoyl)-8H-indeno[1,2-d]thiazol-4-yloxy)methylphosphonic acid::CHEMBL597891
SMILES: CNC(=O)c1ccc(OCP(O)(O)=O)c-2c1Cc1scnc-21
InChI Key: InChIKey=YBWLORZYAZYADS-UHFFFAOYSA-N
Data: 1 IC50
Activity Spreadsheet -- Enzyme Inhibition Constant Data from BindingDB
Found 1 hit for monomerid = 50310095
Trg + Lig
Ki
nM
ΔG°
kcal/mole
IC50
nM
Kd
nM
EC50/IC50
nM
koff
s-1
kon
M-1s-1
pHTemp
°C
Fructose-1,6-bisphosphatase 1 (FBPase)
(Homo sapiens (Human))
BDBM50310095
((7-(methylcarbamoyl)-8H-indeno[1,2-d]thiazol-4-ylo...)
Show SMILES CNC(=O)c1ccc(OCP(O)(O)=O)c-2c1Cc1scnc-21
Show InChI InChI=1S/C13H13N2O5PS/c1-14-13(16)7-2-3-9(20-6-21(17,18)19)11-8(7)4-10-12(11)15-5-22-10/h2-3,5H,4,6H2,1H3,(H,14,16)(H2,17,18,19)
n/an/a 2n/an/an/an/an/an/a
Daiichi Sankyo Co, Ltd
Curated by ChEMBL
Assay Description
Inhibition of human liver recombinant FBPase
Bioorg Med Chem Lett 20: 1004-7 (2010)
Article DOI: 10.1016/j.bmcl.2009.12.056
BindingDB Entry DOI: 10.7270/Q2JW8F1D