BDBM50310162 (5S)-2-amino-5-(2,6-diethylpyridin-4-yl)-3-methyl-5-(3-pyrimidin-5-ylphenyl)-3,5-dihydro-4H-imidazol-4-one::(S)-2-amino-4-(2,6-diethylpyridin-4-yl)-1-methyl-4-(3-(pyrimidin-5-yl)phenyl)-1H-imidazol-5(4H)-one::CHEMBL590730
SMILES: CCc1cc(cc(CC)n1)[C@@]1(N=C(N)N(C)C1=O)c1cccc(c1)-c1cncnc1
InChI Key: InChIKey=QQPRKWVAAAEILV-QHCPKHFHSA-N
Data: 1 IC50
PDB links: 1 PDB ID matches this monomer.
Activity Spreadsheet -- Enzyme Inhibition Constant Data from BindingDB
Found 1 hit for monomerid = 50310162
Trg + Lig
Ki
nM
ΔG°
kcal/mole
IC50
nM
Kd
nM
EC50/IC50
nM
koff
s-1
kon
M-1s-1
pHTemp
°C
Beta-secretase 1
(Homo sapiens (Human))
BDBM50310162
((5S)-2-amino-5-(2,6-diethylpyridin-4-yl)-3-methyl-...)
Show SMILES CCc1cc(cc(CC)n1)[C@@]1(N=C(N)N(C)C1=O)c1cccc(c1)-c1cncnc1 |r,t:12|
Show InChI InChI=1S/C23H24N6O/c1-4-19-10-18(11-20(5-2)27-19)23(21(30)29(3)22(24)28-23)17-8-6-7-15(9-17)16-12-25-14-26-13-16/h6-14H,4-5H2,1-3H3,(H2,24,28)/t23-/m0/s1
n/an/a 30n/an/an/an/an/an/a
Wyeth Research
Curated by ChEMBL
Assay Description
Inhibition of human BACE1 by FRET assay
Bioorg Med Chem 18: 630-9 (2010)
Article DOI: 10.1016/j.bmc.2009.12.007
BindingDB Entry DOI: 10.7270/Q2DV1KT4
3D
3D Structure (crystal)