BDBM50310324 CHEMBL589515::Phe-D-Phe-Arg-Trp-NH2
SMILES: N[C@@H](Cc1ccccc1)C(=O)N[C@H](Cc1ccccc1)C(=O)N[C@@H](CCCN=C(N)N)C(=O)N[C@@H](Cc1c[nH]c2ccccc12)C(N)=O
InChI Key: InChIKey=NYOUWNQJCVZGBR-ZVVXMFRTSA-N
Data: 4 EC50
Activity Spreadsheet -- Enzyme Inhibition Constant Data from BindingDB
Found 4 hits for monomerid = 50310324
Trg + Lig
Ki
nM
ΔG°
kcal/mole
IC50
nM
Kd
nM
EC50/IC50
nM
koff
s-1
kon
M-1s-1
pHTemp
°C
Melanocyte-stimulating hormone receptor
(Mus musculus)
BDBM50310324
(CHEMBL589515 | Phe-D-Phe-Arg-Trp-NH2)
Show SMILES N[C@@H](Cc1ccccc1)C(=O)N[C@H](Cc1ccccc1)C(=O)N[C@@H](CCCN=C(N)N)C(=O)N[C@@H](Cc1c[nH]c2ccccc12)C(N)=O |r,wU:34.35,wD:1.0,12.12,23.24,(-11.51,1.41,;-10.19,.63,;-10.2,-.91,;-8.88,-1.7,;-8.89,-3.23,;-7.56,-4.02,;-6.22,-3.26,;-6.21,-1.72,;-7.54,-.94,;-8.85,1.38,;-8.83,2.93,;-7.52,.6,;-6.18,1.36,;-6.16,2.9,;-4.82,3.66,;-4.81,5.2,;-3.47,5.96,;-2.14,5.17,;-2.16,3.63,;-3.5,2.88,;-4.85,.58,;-4.87,-.96,;-3.51,1.33,;-2.19,.55,;-2.2,-.99,;-.88,-1.77,;-.89,-3.31,;.44,-4.1,;.43,-5.63,;1.75,-6.42,;-.91,-6.39,;-.84,1.31,;-.82,2.85,;.48,.52,;1.83,1.28,;1.85,2.83,;3.18,3.58,;4.44,2.69,;5.67,3.61,;5.18,5.07,;5.93,6.41,;5.15,7.75,;3.61,7.73,;2.86,6.38,;3.64,5.05,;3.15,.51,;4.5,1.26,;3.14,-1.04,)|
Show InChI InChI=1S/C35H43N9O4/c36-26(18-22-10-3-1-4-11-22)32(46)44-30(19-23-12-5-2-6-13-23)34(48)42-28(16-9-17-40-35(38)39)33(47)43-29(31(37)45)20-24-21-41-27-15-8-7-14-25(24)27/h1-8,10-15,21,26,28-30,41H,9,16-20,36H2,(H2,37,45)(H,42,48)(H,43,47)(H,44,46)(H4,38,39,40)/t26-,28-,29-,30+/m0/s1
n/an/an/an/a 503n/an/an/an/a
The Hebrew University of Jerusalem
Curated by ChEMBL
Assay Description
Agonist activity at mouse MC1R expressed in HEK293 cells by beta-galactosidase reporter gene assay
Bioorg Med Chem 18: 580-9 (2010)
Article DOI: 10.1016/j.bmc.2009.12.010
BindingDB Entry DOI: 10.7270/Q20Z73C3
Melanocortin receptor 5
(Mus musculus (Mouse))
BDBM50310324
(CHEMBL589515 | Phe-D-Phe-Arg-Trp-NH2)
Show SMILES N[C@@H](Cc1ccccc1)C(=O)N[C@H](Cc1ccccc1)C(=O)N[C@@H](CCCN=C(N)N)C(=O)N[C@@H](Cc1c[nH]c2ccccc12)C(N)=O |r,wU:34.35,wD:1.0,12.12,23.24,(-11.51,1.41,;-10.19,.63,;-10.2,-.91,;-8.88,-1.7,;-8.89,-3.23,;-7.56,-4.02,;-6.22,-3.26,;-6.21,-1.72,;-7.54,-.94,;-8.85,1.38,;-8.83,2.93,;-7.52,.6,;-6.18,1.36,;-6.16,2.9,;-4.82,3.66,;-4.81,5.2,;-3.47,5.96,;-2.14,5.17,;-2.16,3.63,;-3.5,2.88,;-4.85,.58,;-4.87,-.96,;-3.51,1.33,;-2.19,.55,;-2.2,-.99,;-.88,-1.77,;-.89,-3.31,;.44,-4.1,;.43,-5.63,;1.75,-6.42,;-.91,-6.39,;-.84,1.31,;-.82,2.85,;.48,.52,;1.83,1.28,;1.85,2.83,;3.18,3.58,;4.44,2.69,;5.67,3.61,;5.18,5.07,;5.93,6.41,;5.15,7.75,;3.61,7.73,;2.86,6.38,;3.64,5.05,;3.15,.51,;4.5,1.26,;3.14,-1.04,)|
Show InChI InChI=1S/C35H43N9O4/c36-26(18-22-10-3-1-4-11-22)32(46)44-30(19-23-12-5-2-6-13-23)34(48)42-28(16-9-17-40-35(38)39)33(47)43-29(31(37)45)20-24-21-41-27-15-8-7-14-25(24)27/h1-8,10-15,21,26,28-30,41H,9,16-20,36H2,(H2,37,45)(H,42,48)(H,43,47)(H,44,46)(H4,38,39,40)/t26-,28-,29-,30+/m0/s1
n/an/an/an/a 143n/an/an/an/a
The Hebrew University of Jerusalem
Curated by ChEMBL
Assay Description
Agonist activity at mouse MC5R expressed in HEK293 cells by beta-galactosidase reporter gene assay
Bioorg Med Chem 18: 580-9 (2010)
Article DOI: 10.1016/j.bmc.2009.12.010
BindingDB Entry DOI: 10.7270/Q20Z73C3
Melanocortin receptor 3
(Mus musculus)
BDBM50310324
(CHEMBL589515 | Phe-D-Phe-Arg-Trp-NH2)
Show SMILES N[C@@H](Cc1ccccc1)C(=O)N[C@H](Cc1ccccc1)C(=O)N[C@@H](CCCN=C(N)N)C(=O)N[C@@H](Cc1c[nH]c2ccccc12)C(N)=O |r,wU:34.35,wD:1.0,12.12,23.24,(-11.51,1.41,;-10.19,.63,;-10.2,-.91,;-8.88,-1.7,;-8.89,-3.23,;-7.56,-4.02,;-6.22,-3.26,;-6.21,-1.72,;-7.54,-.94,;-8.85,1.38,;-8.83,2.93,;-7.52,.6,;-6.18,1.36,;-6.16,2.9,;-4.82,3.66,;-4.81,5.2,;-3.47,5.96,;-2.14,5.17,;-2.16,3.63,;-3.5,2.88,;-4.85,.58,;-4.87,-.96,;-3.51,1.33,;-2.19,.55,;-2.2,-.99,;-.88,-1.77,;-.89,-3.31,;.44,-4.1,;.43,-5.63,;1.75,-6.42,;-.91,-6.39,;-.84,1.31,;-.82,2.85,;.48,.52,;1.83,1.28,;1.85,2.83,;3.18,3.58,;4.44,2.69,;5.67,3.61,;5.18,5.07,;5.93,6.41,;5.15,7.75,;3.61,7.73,;2.86,6.38,;3.64,5.05,;3.15,.51,;4.5,1.26,;3.14,-1.04,)|
Show InChI InChI=1S/C35H43N9O4/c36-26(18-22-10-3-1-4-11-22)32(46)44-30(19-23-12-5-2-6-13-23)34(48)42-28(16-9-17-40-35(38)39)33(47)43-29(31(37)45)20-24-21-41-27-15-8-7-14-25(24)27/h1-8,10-15,21,26,28-30,41H,9,16-20,36H2,(H2,37,45)(H,42,48)(H,43,47)(H,44,46)(H4,38,39,40)/t26-,28-,29-,30+/m0/s1
Reactome pathway
n/an/an/an/a 1.19E+4n/an/an/an/a
The Hebrew University of Jerusalem
Curated by ChEMBL
Assay Description
Agonist activity at mouse MC3R expressed in HEK293 cells by beta-galactosidase reporter gene assay
Bioorg Med Chem 18: 580-9 (2010)
Article DOI: 10.1016/j.bmc.2009.12.010
BindingDB Entry DOI: 10.7270/Q20Z73C3
Melanocortin receptor 4
(Mus musculus)
BDBM50310324
(CHEMBL589515 | Phe-D-Phe-Arg-Trp-NH2)
Show SMILES N[C@@H](Cc1ccccc1)C(=O)N[C@H](Cc1ccccc1)C(=O)N[C@@H](CCCN=C(N)N)C(=O)N[C@@H](Cc1c[nH]c2ccccc12)C(N)=O |r,wU:34.35,wD:1.0,12.12,23.24,(-11.51,1.41,;-10.19,.63,;-10.2,-.91,;-8.88,-1.7,;-8.89,-3.23,;-7.56,-4.02,;-6.22,-3.26,;-6.21,-1.72,;-7.54,-.94,;-8.85,1.38,;-8.83,2.93,;-7.52,.6,;-6.18,1.36,;-6.16,2.9,;-4.82,3.66,;-4.81,5.2,;-3.47,5.96,;-2.14,5.17,;-2.16,3.63,;-3.5,2.88,;-4.85,.58,;-4.87,-.96,;-3.51,1.33,;-2.19,.55,;-2.2,-.99,;-.88,-1.77,;-.89,-3.31,;.44,-4.1,;.43,-5.63,;1.75,-6.42,;-.91,-6.39,;-.84,1.31,;-.82,2.85,;.48,.52,;1.83,1.28,;1.85,2.83,;3.18,3.58,;4.44,2.69,;5.67,3.61,;5.18,5.07,;5.93,6.41,;5.15,7.75,;3.61,7.73,;2.86,6.38,;3.64,5.05,;3.15,.51,;4.5,1.26,;3.14,-1.04,)|
Show InChI InChI=1S/C35H43N9O4/c36-26(18-22-10-3-1-4-11-22)32(46)44-30(19-23-12-5-2-6-13-23)34(48)42-28(16-9-17-40-35(38)39)33(47)43-29(31(37)45)20-24-21-41-27-15-8-7-14-25(24)27/h1-8,10-15,21,26,28-30,41H,9,16-20,36H2,(H2,37,45)(H,42,48)(H,43,47)(H,44,46)(H4,38,39,40)/t26-,28-,29-,30+/m0/s1
n/an/an/an/a 71n/an/an/an/a
The Hebrew University of Jerusalem
Curated by ChEMBL
Assay Description
Agonist activity at mouse MC4R expressed in HEK293 cells by beta-galactosidase reporter gene assay
Bioorg Med Chem 18: 580-9 (2010)
Article DOI: 10.1016/j.bmc.2009.12.010
BindingDB Entry DOI: 10.7270/Q20Z73C3