BDBM50310522 2alpha-Hydroxyurs-12-en-28-oic acid::CHEMBL1078844
SMILES: C[C@@H]1CC[C@@]2(CC[C@]3(C)C(=CC[C@@H]4[C@@]5(C)C[C@@H](O)CC(C)(C)[C@@H]5CC[C@@]34C)[C@@H]2[C@H]1C)C(O)=O
InChI Key: InChIKey=DDHYEJNMSYDDTH-ZWHPGZRZSA-N
Data: 1 IC50
Activity Spreadsheet -- Enzyme Inhibition Constant Data from BindingDB
Found 1 hit for monomerid = 50310522
Trg + Lig
Ki
nM
ΔG°
kcal/mole
IC50
nM
Kd
nM
EC50/IC50
nM
koff
s-1
kon
M-1s-1
pHTemp
°C
Glycogen phosphorylase, muscle form
(Oryctolagus cuniculus (rabbit))
BDBM50310522
(2alpha-Hydroxyurs-12-en-28-oic acid | CHEMBL107884...)
Show SMILES C[C@@H]1CC[C@@]2(CC[C@]3(C)C(=CC[C@@H]4[C@@]5(C)C[C@@H](O)CC(C)(C)[C@@H]5CC[C@@]34C)[C@@H]2[C@H]1C)C(O)=O |r,c:9|
Show InChI InChI=1S/C30H48O3/c1-18-10-13-30(25(32)33)15-14-28(6)21(24(30)19(18)2)8-9-23-27(5)17-20(31)16-26(3,4)22(27)11-12-29(23,28)7/h8,18-20,22-24,31H,9-17H2,1-7H3,(H,32,33)/t18-,19+,20+,22+,23-,24+,27+,28-,29-,30+/m1/s1
n/an/a 1.20E+3n/an/an/an/an/an/a
China Pharmaceutical University
Curated by ChEMBL
Assay Description
Inhibition of rabbit muscle glycogen phosphorylase assessed as release of phosphate from glucose-1-phosphate after 25 mins
J Nat Prod 72: 1414-8 (2009)
Article DOI: 10.1021/np9002367
BindingDB Entry DOI: 10.7270/Q2B8587T