BDBM50310614 CHEMBL1078906::N-(4-(1H-benzo[d]imidazol-2-ylamino)phenethyl)thieno[3,2-d]pyrimidin-4-amine
SMILES: C(Cc1ccc(Nc2nc3ccccc3[nH]2)cc1)Nc1ncnc2ccsc12
InChI Key: InChIKey=NCBGQRJCNZUAKT-UHFFFAOYSA-N
Data: 2 IC50
Activity Spreadsheet -- Enzyme Inhibition Constant Data from BindingDB
Found 2 hits for monomerid = 50310614
Trg + Lig
Ki
nM
ΔG°
kcal/mole
IC50
nM
Kd
nM
EC50/IC50
nM
koff
s-1
kon
M-1s-1
pHTemp
°C
Aurora kinase A
(Homo sapiens (Human))
BDBM50310614
(CHEMBL1078906 | N-(4-(1H-benzo[d]imidazol-2-ylamin...)
Show SMILES C(Cc1ccc(Nc2nc3ccccc3[nH]2)cc1)Nc1ncnc2ccsc12
Show InChI InChI=1S/C21H18N6S/c1-2-4-17-16(3-1)26-21(27-17)25-15-7-5-14(6-8-15)9-11-22-20-19-18(10-12-28-19)23-13-24-20/h1-8,10,12-13H,9,11H2,(H,22,23,24)(H2,25,26,27)
NCI pathway
Reactome pathway
n/an/a 28n/an/an/an/an/an/a
Sunesis Pharmaceuticals, Inc.
Curated by ChEMBL
Assay Description
Inhibition of Aurora A after 60 mins
Bioorg Med Chem Lett 19: 5158-61 (2009)
Article DOI: 10.1016/j.bmcl.2009.07.016
BindingDB Entry DOI: 10.7270/Q2T72HK2
Aurora kinase B
(Homo sapiens (Human))
BDBM50310614
(CHEMBL1078906 | N-(4-(1H-benzo[d]imidazol-2-ylamin...)
Show SMILES C(Cc1ccc(Nc2nc3ccccc3[nH]2)cc1)Nc1ncnc2ccsc12
Show InChI InChI=1S/C21H18N6S/c1-2-4-17-16(3-1)26-21(27-17)25-15-7-5-14(6-8-15)9-11-22-20-19-18(10-12-28-19)23-13-24-20/h1-8,10,12-13H,9,11H2,(H,22,23,24)(H2,25,26,27)
Reactome pathway
n/an/a 10n/an/an/an/an/an/a
Sunesis Pharmaceuticals, Inc.
Curated by ChEMBL
Assay Description
Inhibition of Aurora B after 60 mins
Bioorg Med Chem Lett 19: 5158-61 (2009)
Article DOI: 10.1016/j.bmcl.2009.07.016
BindingDB Entry DOI: 10.7270/Q2T72HK2