BDBM50310638 CHEMBL1080063::N-(4-(3-(5-tert-butylisoxazol-3-yl)ureido)phenyl)-5-methylbenzo[b]thiophene-2-carboxamide
SMILES: Cc1ccc2sc(cc2c1)C(=O)Nc1ccc(NC(=O)Nc2cc(on2)C(C)(C)C)cc1
InChI Key: InChIKey=ROCCXTVQIHMEEO-UHFFFAOYSA-N
Data: 1 Kd
Activity Spreadsheet -- Enzyme Inhibition Constant Data from BindingDB
Found 1 hit for monomerid = 50310638
Trg + Lig
Ki
nM
ΔG°
kcal/mole
IC50
nM
Kd
nM
EC50/IC50
nM
koff
s-1
kon
M-1s-1
pHTemp
°C
Receptor-type tyrosine-protein kinase FLT3
(Homo sapiens (Human))
BDBM50310638
(CHEMBL1080063 | N-(4-(3-(5-tert-butylisoxazol-3-yl...)
Show SMILES Cc1ccc2sc(cc2c1)C(=O)Nc1ccc(NC(=O)Nc2cc(on2)C(C)(C)C)cc1
Show InChI InChI=1S/C24H24N4O3S/c1-14-5-10-18-15(11-14)12-19(32-18)22(29)25-16-6-8-17(9-7-16)26-23(30)27-21-13-20(31-28-21)24(2,3)4/h5-13H,1-4H3,(H,25,29)(H2,26,27,28,30)
n/an/an/a 0.770n/an/an/an/an/a
Ambit Biosciences Inc.
Curated by ChEMBL
Assay Description
Binding affinity to FLT3
Bioorg Med Chem Lett 19: 5182-5 (2009)
Article DOI: 10.1016/j.bmcl.2009.07.024
BindingDB Entry DOI: 10.7270/Q2PG1RVB