BDBM50310731 4-butyl-3-(cyclohexylmethyl)-8-(1-(4,6-dimethylpyrimidine-5-carbonyl)-4-methylpiperidin-4-yl)-1-oxa-3,8-diazaspiro[4.5]decan-2-one::CHEMBL1077912
SMILES: CCCCC1N(CC2CCCCC2)C(=O)OC11CCN(CC1)C1(C)CCN(CC1)C(=O)c1c(C)ncnc1C
InChI Key: InChIKey=SOTWHQNDCMJPNL-UHFFFAOYSA-N
Data: 1 IC50
Activity Spreadsheet -- Enzyme Inhibition Constant Data from BindingDB
Found 1 hit for monomerid = 50310731
Trg + Lig
Ki
nM
ΔG°
kcal/mole
IC50
nM
Kd
nM
EC50/IC50
nM
koff
s-1
kon
M-1s-1
pHTemp
°C
C-C chemokine receptor type 5
(Homo sapiens (Human))
BDBM50310731
(4-butyl-3-(cyclohexylmethyl)-8-(1-(4,6-dimethylpyr...)
Show SMILES CCCCC1N(CC2CCCCC2)C(=O)OC11CCN(CC1)C1(C)CCN(CC1)C(=O)c1c(C)ncnc1C
Show InChI InChI=1S/C31H49N5O3/c1-5-6-12-26-31(39-29(38)36(26)21-25-10-8-7-9-11-25)15-19-35(20-16-31)30(4)13-17-34(18-14-30)28(37)27-23(2)32-22-33-24(27)3/h22,25-26H,5-21H2,1-4H3
n/an/a 7n/an/an/an/an/an/a
Roche Palo Alto LLC
Curated by ChEMBL
Assay Description
Displacement of [125I]RANTES from human CCR5 receptor cotransfected with Galphai6 in CHO cells
Bioorg Med Chem Lett 19: 5401-6 (2009)
Article DOI: 10.1016/j.bmcl.2009.07.122
BindingDB Entry DOI: 10.7270/Q25H7GD5