BDBM50310739 (S)-5-butyl-9-(1-(4,6-dimethylpyrimidine-5-carbonyl)-4-methylpiperidin-4-yl)-3-((tetrahydro-2H-pyran-4-yl)methyl)-1-oxa-3,9-diazaspiro[5.5]undecan-2-one::CHEMBL1078231
SMILES: CCCC[C@H]1CN(CC2CCOCC2)C(=O)OC11CCN(CC1)C1(C)CCN(CC1)C(=O)c1c(C)ncnc1C
InChI Key: InChIKey=CXXVJZRGOOIVOD-SANMLTNESA-N
Data: 9 IC50
Activity Spreadsheet -- Enzyme Inhibition Constant Data from BindingDB
Found 9 hits for monomerid = 50310739
Trg + Lig
Ki
nM
ΔG°
kcal/mole
IC50
nM
Kd
nM
EC50/IC50
nM
koff
s-1
kon
M-1s-1
pHTemp
°C
C-C chemokine receptor type 5
(Homo sapiens (Human))
BDBM50310739
((S)-5-butyl-9-(1-(4,6-dimethylpyrimidine-5-carbony...)
Show SMILES CCCC[C@H]1CN(CC2CCOCC2)C(=O)OC11CCN(CC1)C1(C)CCN(CC1)C(=O)c1c(C)ncnc1C |r|
Show InChI InChI=1S/C31H49N5O4/c1-5-6-7-26-21-35(20-25-8-18-39-19-9-25)29(38)40-31(26)12-16-36(17-13-31)30(4)10-14-34(15-11-30)28(37)27-23(2)32-22-33-24(27)3/h22,25-26H,5-21H2,1-4H3/t26-/m0/s1
n/an/a 25n/an/an/an/an/an/a
Roche Palo Alto LLC
Curated by ChEMBL
Assay Description
Displacement of [125I]RANTES from human CCR5 receptor cotransfected with Galphai6 in CHO cells
Bioorg Med Chem Lett 19: 5401-6 (2009)
Article DOI: 10.1016/j.bmcl.2009.07.122
BindingDB Entry DOI: 10.7270/Q25H7GD5
C-C chemokine receptor type 1
(Homo sapiens (Human))
BDBM50310739
((S)-5-butyl-9-(1-(4,6-dimethylpyrimidine-5-carbony...)
Show SMILES CCCC[C@H]1CN(CC2CCOCC2)C(=O)OC11CCN(CC1)C1(C)CCN(CC1)C(=O)c1c(C)ncnc1C |r|
Show InChI InChI=1S/C31H49N5O4/c1-5-6-7-26-21-35(20-25-8-18-39-19-9-25)29(38)40-31(26)12-16-36(17-13-31)30(4)10-14-34(15-11-30)28(37)27-23(2)32-22-33-24(27)3/h22,25-26H,5-21H2,1-4H3/t26-/m0/s1
Reactome pathway
n/an/a>5.00E+4n/an/an/an/an/an/a
Roche Palo Alto LLC
Curated by ChEMBL
Assay Description
Binding affinity to human CCR1 receptor
Bioorg Med Chem Lett 19: 5401-6 (2009)
Article DOI: 10.1016/j.bmcl.2009.07.122
BindingDB Entry DOI: 10.7270/Q25H7GD5
C-C chemokine receptor type 2
(Homo sapiens (Human))
BDBM50310739
((S)-5-butyl-9-(1-(4,6-dimethylpyrimidine-5-carbony...)
Show SMILES CCCC[C@H]1CN(CC2CCOCC2)C(=O)OC11CCN(CC1)C1(C)CCN(CC1)C(=O)c1c(C)ncnc1C |r|
Show InChI InChI=1S/C31H49N5O4/c1-5-6-7-26-21-35(20-25-8-18-39-19-9-25)29(38)40-31(26)12-16-36(17-13-31)30(4)10-14-34(15-11-30)28(37)27-23(2)32-22-33-24(27)3/h22,25-26H,5-21H2,1-4H3/t26-/m0/s1
n/an/a>5.00E+4n/an/an/an/an/an/a
Roche Palo Alto LLC
Curated by ChEMBL
Assay Description
Binding affinity to human CCR2b receptor
Bioorg Med Chem Lett 19: 5401-6 (2009)
Article DOI: 10.1016/j.bmcl.2009.07.122
BindingDB Entry DOI: 10.7270/Q25H7GD5
C-C chemokine receptor type 3
(Homo sapiens (Human))
BDBM50310739
((S)-5-butyl-9-(1-(4,6-dimethylpyrimidine-5-carbony...)
Show SMILES CCCC[C@H]1CN(CC2CCOCC2)C(=O)OC11CCN(CC1)C1(C)CCN(CC1)C(=O)c1c(C)ncnc1C |r|
Show InChI InChI=1S/C31H49N5O4/c1-5-6-7-26-21-35(20-25-8-18-39-19-9-25)29(38)40-31(26)12-16-36(17-13-31)30(4)10-14-34(15-11-30)28(37)27-23(2)32-22-33-24(27)3/h22,25-26H,5-21H2,1-4H3/t26-/m0/s1
Reactome pathway
n/an/a>5.00E+4n/an/an/an/an/an/a
Roche Palo Alto LLC
Curated by ChEMBL
Assay Description
Binding affinity to human CCR3 receptor
Bioorg Med Chem Lett 19: 5401-6 (2009)
Article DOI: 10.1016/j.bmcl.2009.07.122
BindingDB Entry DOI: 10.7270/Q25H7GD5
C-C chemokine receptor type 5
(Homo sapiens (Human))
BDBM50310739
((S)-5-butyl-9-(1-(4,6-dimethylpyrimidine-5-carbony...)
Show SMILES CCCC[C@H]1CN(CC2CCOCC2)C(=O)OC11CCN(CC1)C1(C)CCN(CC1)C(=O)c1c(C)ncnc1C |r|
Show InChI InChI=1S/C31H49N5O4/c1-5-6-7-26-21-35(20-25-8-18-39-19-9-25)29(38)40-31(26)12-16-36(17-13-31)30(4)10-14-34(15-11-30)28(37)27-23(2)32-22-33-24(27)3/h22,25-26H,5-21H2,1-4H3/t26-/m0/s1
n/an/a 4n/an/an/an/an/an/a
Roche Palo Alto
Curated by ChEMBL
Assay Description
Displacement of [128I]-RANTES from CCR5 receptor receptors expressed in CHO cells
Bioorg Med Chem Lett 20: 1830-3 (2010)
Article DOI: 10.1016/j.bmcl.2010.02.004
BindingDB Entry DOI: 10.7270/Q25Q4W7T
C-C chemokine receptor type 6 (CCR6)
(Homo sapiens (Human))
BDBM50310739
((S)-5-butyl-9-(1-(4,6-dimethylpyrimidine-5-carbony...)
Show SMILES CCCC[C@H]1CN(CC2CCOCC2)C(=O)OC11CCN(CC1)C1(C)CCN(CC1)C(=O)c1c(C)ncnc1C |r|
Show InChI InChI=1S/C31H49N5O4/c1-5-6-7-26-21-35(20-25-8-18-39-19-9-25)29(38)40-31(26)12-16-36(17-13-31)30(4)10-14-34(15-11-30)28(37)27-23(2)32-22-33-24(27)3/h22,25-26H,5-21H2,1-4H3/t26-/m0/s1
n/an/a>5.00E+4n/an/an/an/an/an/a
Roche Palo Alto LLC
Curated by ChEMBL
Assay Description
Binding affinity to human CCR6 receptor
Bioorg Med Chem Lett 19: 5401-6 (2009)
Article DOI: 10.1016/j.bmcl.2009.07.122
BindingDB Entry DOI: 10.7270/Q25H7GD5
C-X-C chemokine receptor type 4 (CXCR4)
(Homo sapiens (Human))
BDBM50310739
((S)-5-butyl-9-(1-(4,6-dimethylpyrimidine-5-carbony...)
Show SMILES CCCC[C@H]1CN(CC2CCOCC2)C(=O)OC11CCN(CC1)C1(C)CCN(CC1)C(=O)c1c(C)ncnc1C |r|
Show InChI InChI=1S/C31H49N5O4/c1-5-6-7-26-21-35(20-25-8-18-39-19-9-25)29(38)40-31(26)12-16-36(17-13-31)30(4)10-14-34(15-11-30)28(37)27-23(2)32-22-33-24(27)3/h22,25-26H,5-21H2,1-4H3/t26-/m0/s1
n/an/a>5.00E+4n/an/an/an/an/an/a
Roche Palo Alto LLC
Curated by ChEMBL
Assay Description
Binding affinity to human CXCR4
Bioorg Med Chem Lett 19: 5401-6 (2009)
Article DOI: 10.1016/j.bmcl.2009.07.122
BindingDB Entry DOI: 10.7270/Q25H7GD5
Potassium voltage-gated channel subfamily H member 2
(Homo sapiens (Human))
BDBM50310739
((S)-5-butyl-9-(1-(4,6-dimethylpyrimidine-5-carbony...)
Show SMILES CCCC[C@H]1CN(CC2CCOCC2)C(=O)OC11CCN(CC1)C1(C)CCN(CC1)C(=O)c1c(C)ncnc1C |r|
Show InChI InChI=1S/C31H49N5O4/c1-5-6-7-26-21-35(20-25-8-18-39-19-9-25)29(38)40-31(26)12-16-36(17-13-31)30(4)10-14-34(15-11-30)28(37)27-23(2)32-22-33-24(27)3/h22,25-26H,5-21H2,1-4H3/t26-/m0/s1
Reactome pathway
n/an/a 1.19E+4n/an/an/an/an/an/a
Roche Palo Alto LLC
Curated by ChEMBL
Assay Description
Inhibition of human ERG
Bioorg Med Chem Lett 19: 5401-6 (2009)
Article DOI: 10.1016/j.bmcl.2009.07.122
BindingDB Entry DOI: 10.7270/Q25H7GD5
C-C chemokine receptor type 4 (CCR4)
(Homo sapiens (Human))
BDBM50310739
((S)-5-butyl-9-(1-(4,6-dimethylpyrimidine-5-carbony...)
Show SMILES CCCC[C@H]1CN(CC2CCOCC2)C(=O)OC11CCN(CC1)C1(C)CCN(CC1)C(=O)c1c(C)ncnc1C |r|
Show InChI InChI=1S/C31H49N5O4/c1-5-6-7-26-21-35(20-25-8-18-39-19-9-25)29(38)40-31(26)12-16-36(17-13-31)30(4)10-14-34(15-11-30)28(37)27-23(2)32-22-33-24(27)3/h22,25-26H,5-21H2,1-4H3/t26-/m0/s1
n/an/a>5.00E+4n/an/an/an/an/an/a
Roche Palo Alto LLC
Curated by ChEMBL
Assay Description
Binding affinity to human CCR4 receptor
Bioorg Med Chem Lett 19: 5401-6 (2009)
Article DOI: 10.1016/j.bmcl.2009.07.122
BindingDB Entry DOI: 10.7270/Q25H7GD5