null
SMILES: CCN(CC(COCc1ccccc1)NC(=O)OCc1cncs1)CC(COCc1ccccc1)NC(=O)OCc1nccs1
InChI Key: InChIKey=CZQXPDBVKLWLQZ-UHFFFAOYSA-N
Activity Spreadsheet -- Enzyme Inhibition Constant Data from BindingDB
Found 1 hit for monomerid = 50310777
Trg + Lig
Ki
nM
ΔG°
kcal/mole
IC50
nM
Kd
nM
EC50/IC50
nM
koff
s-1
kon
M-1s-1
pHTemp
°C
Cytochrome P450 3A4
(Homo sapiens (Human))
BDBM50310777
(CHEMBL1078121 | N-[(S)-2-(thiazol-5-ylmethoxycarbo...)
Show SMILES CCN(CC(COCc1ccccc1)NC(=O)OCc1cncs1)CC(COCc1ccccc1)NC(=O)OCc1nccs1
Show InChI InChI=1S/C32H39N5O6S2/c1-2-37(16-27(20-40-18-25-9-5-3-6-10-25)35-31(38)42-22-29-15-33-24-45-29)17-28(21-41-19-26-11-7-4-8-12-26)36-32(39)43-23-30-34-13-14-44-30/h3-15,24,27-28H,2,16-23H2,1H3,(H,35,38)(H,36,39)
Reactome pathway
n/an/a 135n/an/an/an/an/an/a
Abbott Laboratories
Curated by ChEMBL
Assay Description
Inhibition of human recombinant CYP3A4-mediated oxidation of 7-benzyloxyquinoline
Bioorg Med Chem Lett 19: 5444-8 (2009)
Article DOI: 10.1016/j.bmcl.2009.07.118
BindingDB Entry DOI: 10.7270/Q21R6QN0