null
SMILES: CCN(C[C@H](Cc1ccccc1)NC(=O)OCc1cnc[nH]1)C[C@H](Cc1ccccc1)NC(=O)OCc1ncc[nH]1
InChI Key: InChIKey=LJXHKSLKMJASBE-UIOOFZCWSA-N
Activity Spreadsheet -- Enzyme Inhibition Constant Data from BindingDB
Found 1 hit for monomerid = 50310781
Trg + Lig
Ki
nM
ΔG°
kcal/mole
IC50
nM
Kd
nM
EC50/IC50
nM
koff
s-1
kon
M-1s-1
pHTemp
°C
Cytochrome P450 3A4
(Homo sapiens (Human))
BDBM50310781
(Bis-N-[(S)-2-(imidazol-4-ylmethoxycarbonylamino)-3...)
Show SMILES CCN(C[C@H](Cc1ccccc1)NC(=O)OCc1cnc[nH]1)C[C@H](Cc1ccccc1)NC(=O)OCc1ncc[nH]1 |r|
Show InChI InChI=1S/C30H37N7O4/c1-2-37(18-25(15-23-9-5-3-6-10-23)35-29(38)40-20-27-17-31-22-34-27)19-26(16-24-11-7-4-8-12-24)36-30(39)41-21-28-32-13-14-33-28/h3-14,17,22,25-26H,2,15-16,18-21H2,1H3,(H,31,34)(H,32,33)(H,35,38)(H,36,39)/t25-,26-/m0/s1
Reactome pathway
n/an/a 348n/an/an/an/an/an/a
Abbott Laboratories
Curated by ChEMBL
Assay Description
Inhibition of human recombinant CYP3A4-mediated oxidation of 7-benzyloxyquinoline
Bioorg Med Chem Lett 19: 5444-8 (2009)
Article DOI: 10.1016/j.bmcl.2009.07.118
BindingDB Entry DOI: 10.7270/Q21R6QN0