BDBM50310799 CHEMBL1078265::N-(4-chlorophenethyl)-3-methyl-3-phenylpiperidine-1-carboxamide
SMILES: CC1(CCCN(C1)C(=O)NCCc1ccc(Cl)cc1)c1ccccc1
InChI Key: InChIKey=NGZGPRMVYQEQTB-UHFFFAOYSA-N
Data: 4 IC50
Activity Spreadsheet -- Enzyme Inhibition Constant Data from BindingDB
Found 4 hits for monomerid = 50310799
Trg + Lig
Ki
nM
ΔG°
kcal/mole
IC50
nM
Kd
nM
EC50/IC50
nM
koff
s-1
kon
M-1s-1
pHTemp
°C
EBifunctional epoxide hydrolase 2
(Homo sapiens (Human))
BDBM50310799
(CHEMBL1078265 | N-(4-chlorophenethyl)-3-methyl-3-p...)
Show SMILES CC1(CCCN(C1)C(=O)NCCc1ccc(Cl)cc1)c1ccccc1
Show InChI InChI=1S/C21H25ClN2O/c1-21(18-6-3-2-4-7-18)13-5-15-24(16-21)20(25)23-14-12-17-8-10-19(22)11-9-17/h2-4,6-11H,5,12-16H2,1H3,(H,23,25)
n/an/a 1n/an/an/an/an/an/a
Merck Research Laboratories
Curated by ChEMBL
Assay Description
Inhibition of human soluble epoxide hydrolase
Bioorg Med Chem Lett 19: 5314-20 (2009)
Article DOI: 10.1016/j.bmcl.2009.07.138
BindingDB Entry DOI: 10.7270/Q2S75GFP
Cytochrome P450 2C9
(Homo sapiens (Human))
BDBM50310799
(CHEMBL1078265 | N-(4-chlorophenethyl)-3-methyl-3-p...)
Show SMILES CC1(CCCN(C1)C(=O)NCCc1ccc(Cl)cc1)c1ccccc1
Show InChI InChI=1S/C21H25ClN2O/c1-21(18-6-3-2-4-7-18)13-5-15-24(16-21)20(25)23-14-12-17-8-10-19(22)11-9-17/h2-4,6-11H,5,12-16H2,1H3,(H,23,25)
Reactome pathway
n/an/a>1.00E+4n/an/an/an/an/an/a
Merck Research Laboratories
Curated by ChEMBL
Assay Description
Inhibition of CYP2C9
Bioorg Med Chem Lett 19: 5314-20 (2009)
Article DOI: 10.1016/j.bmcl.2009.07.138
BindingDB Entry DOI: 10.7270/Q2S75GFP
Epoxide hydrolase 1
(Homo sapiens (Human))
BDBM50310799
(CHEMBL1078265 | N-(4-chlorophenethyl)-3-methyl-3-p...)
Show SMILES CC1(CCCN(C1)C(=O)NCCc1ccc(Cl)cc1)c1ccccc1
Show InChI InChI=1S/C21H25ClN2O/c1-21(18-6-3-2-4-7-18)13-5-15-24(16-21)20(25)23-14-12-17-8-10-19(22)11-9-17/h2-4,6-11H,5,12-16H2,1H3,(H,23,25)
n/an/a 5.40E+4n/an/an/an/an/an/a
Merck Research Laboratories
Curated by ChEMBL
Assay Description
Inhibition of human microsomal epoxide hydrolase
Bioorg Med Chem Lett 19: 5314-20 (2009)
Article DOI: 10.1016/j.bmcl.2009.07.138
BindingDB Entry DOI: 10.7270/Q2S75GFP
Epoxide hydrolase 2
(Rattus norvegicus)
BDBM50310799
(CHEMBL1078265 | N-(4-chlorophenethyl)-3-methyl-3-p...)
Show SMILES CC1(CCCN(C1)C(=O)NCCc1ccc(Cl)cc1)c1ccccc1
Show InChI InChI=1S/C21H25ClN2O/c1-21(18-6-3-2-4-7-18)13-5-15-24(16-21)20(25)23-14-12-17-8-10-19(22)11-9-17/h2-4,6-11H,5,12-16H2,1H3,(H,23,25)
n/an/a 5n/an/an/an/an/an/a
Merck Research Laboratories
Curated by ChEMBL
Assay Description
Inhibition of rat soluble epoxide hydrolase
Bioorg Med Chem Lett 19: 5314-20 (2009)
Article DOI: 10.1016/j.bmcl.2009.07.138
BindingDB Entry DOI: 10.7270/Q2S75GFP