BDBM50310818 3-methyl-3-phenyl-N-((1S,2R)-2-phenylcyclopropyl)piperidine-1-carboxamide::CHEMBL1077780
SMILES: CC1(CCCN(C1)C(=O)N[C@H]1C[C@@H]1c1ccccc1)c1ccccc1
InChI Key: InChIKey=UUJAMNFWDAPMSE-MFCMXAAESA-N
Data: 4 IC50
Activity Spreadsheet -- Enzyme Inhibition Constant Data from BindingDB
Found 4 hits for monomerid = 50310818
Trg + Lig
Ki
nM
ΔG°
kcal/mole
IC50
nM
Kd
nM
EC50/IC50
nM
koff
s-1
kon
M-1s-1
pHTemp
°C
EBifunctional epoxide hydrolase 2
(Homo sapiens (Human))
BDBM50310818
(3-methyl-3-phenyl-N-((1S,2R)-2-phenylcyclopropyl)p...)
Show SMILES CC1(CCCN(C1)C(=O)N[C@H]1C[C@@H]1c1ccccc1)c1ccccc1 |r|
Show InChI InChI=1S/C22H26N2O/c1-22(18-11-6-3-7-12-18)13-8-14-24(16-22)21(25)23-20-15-19(20)17-9-4-2-5-10-17/h2-7,9-12,19-20H,8,13-16H2,1H3,(H,23,25)/t19-,20+,22?/m1/s1
n/an/a 1n/an/an/an/an/an/a
Merck Research Laboratories
Curated by ChEMBL
Assay Description
Inhibition of human soluble epoxide hydrolase
Bioorg Med Chem Lett 19: 5314-20 (2009)
Article DOI: 10.1016/j.bmcl.2009.07.138
BindingDB Entry DOI: 10.7270/Q2S75GFP
Sodium channel protein type 5 subunit alpha
(Homo sapiens (Human))
BDBM50310818
(3-methyl-3-phenyl-N-((1S,2R)-2-phenylcyclopropyl)p...)
Show SMILES CC1(CCCN(C1)C(=O)N[C@H]1C[C@@H]1c1ccccc1)c1ccccc1 |r|
Show InChI InChI=1S/C22H26N2O/c1-22(18-11-6-3-7-12-18)13-8-14-24(16-22)21(25)23-20-15-19(20)17-9-4-2-5-10-17/h2-7,9-12,19-20H,8,13-16H2,1H3,(H,23,25)/t19-,20+,22?/m1/s1
n/an/a>1.00E+4n/an/an/an/an/an/a
Merck Research Laboratories
Curated by ChEMBL
Assay Description
Inhibition of Nav1.5 channel
Bioorg Med Chem Lett 19: 5314-20 (2009)
Article DOI: 10.1016/j.bmcl.2009.07.138
BindingDB Entry DOI: 10.7270/Q2S75GFP
Epoxide hydrolase 1
(Homo sapiens (Human))
BDBM50310818
(3-methyl-3-phenyl-N-((1S,2R)-2-phenylcyclopropyl)p...)
Show SMILES CC1(CCCN(C1)C(=O)N[C@H]1C[C@@H]1c1ccccc1)c1ccccc1 |r|
Show InChI InChI=1S/C22H26N2O/c1-22(18-11-6-3-7-12-18)13-8-14-24(16-22)21(25)23-20-15-19(20)17-9-4-2-5-10-17/h2-7,9-12,19-20H,8,13-16H2,1H3,(H,23,25)/t19-,20+,22?/m1/s1
n/an/a>1.00E+5n/an/an/an/an/an/a
Merck Research Laboratories
Curated by ChEMBL
Assay Description
Inhibition of human microsomal epoxide hydrolase
Bioorg Med Chem Lett 19: 5314-20 (2009)
Article DOI: 10.1016/j.bmcl.2009.07.138
BindingDB Entry DOI: 10.7270/Q2S75GFP
Epoxide hydrolase 2
(Rattus norvegicus)
BDBM50310818
(3-methyl-3-phenyl-N-((1S,2R)-2-phenylcyclopropyl)p...)
Show SMILES CC1(CCCN(C1)C(=O)N[C@H]1C[C@@H]1c1ccccc1)c1ccccc1 |r|
Show InChI InChI=1S/C22H26N2O/c1-22(18-11-6-3-7-12-18)13-8-14-24(16-22)21(25)23-20-15-19(20)17-9-4-2-5-10-17/h2-7,9-12,19-20H,8,13-16H2,1H3,(H,23,25)/t19-,20+,22?/m1/s1
n/an/a 4n/an/an/an/an/an/a
Merck Research Laboratories
Curated by ChEMBL
Assay Description
Inhibition of rat soluble epoxide hydrolase
Bioorg Med Chem Lett 19: 5314-20 (2009)
Article DOI: 10.1016/j.bmcl.2009.07.138
BindingDB Entry DOI: 10.7270/Q2S75GFP