BDBM50311257 2-hydroxy-6-pentadecyl-4-((2S,3R,4S,5S,6R)-3,4,5-trihydroxy-6-(hydroxymethyl)tetrahydro-2H-pyran-2-yloxy)benzoic acid::CHEMBL1078662
SMILES: CCCCCCCCCCCCCCCc1cc(O[C@@H]2O[C@H](CO)[C@@H](O)[C@H](O)[C@H]2O)cc(O)c1C(O)=O
InChI Key: InChIKey=QPNHZIJNNMFBMD-HOZVGSINSA-N
Data: 1 IC50
Activity Spreadsheet -- Enzyme Inhibition Constant Data from BindingDB
Found 1 hit for monomerid = 50311257
Trg + Lig
Ki
nM
ΔG°
kcal/mole
IC50
nM
Kd
nM
EC50/IC50
nM
koff
s-1
kon
M-1s-1
pHTemp
°C
Protein-tyrosine phosphatase 1B
(Homo sapiens (Human))
BDBM50311257
(2-hydroxy-6-pentadecyl-4-((2S,3R,4S,5S,6R)-3,4,5-t...)
Show SMILES CCCCCCCCCCCCCCCc1cc(O[C@@H]2O[C@H](CO)[C@@H](O)[C@H](O)[C@H]2O)cc(O)c1C(O)=O |r|
Show InChI InChI=1S/C28H46O9/c1-2-3-4-5-6-7-8-9-10-11-12-13-14-15-19-16-20(17-21(30)23(19)27(34)35)36-28-26(33)25(32)24(31)22(18-29)37-28/h16-17,22,24-26,28-33H,2-15,18H2,1H3,(H,34,35)/t22-,24-,25+,26-,28-/m1/s1
NCI pathway
Reactome pathway
n/an/a 590n/an/an/an/an/an/a
Silla University
Curated by ChEMBL
Assay Description
Inhibition of PTP1B mediated pNPP hydrolysis
Bioorg Med Chem Lett 19: 6095-7 (2009)
Article DOI: 10.1016/j.bmcl.2009.09.025
BindingDB Entry DOI: 10.7270/Q22J6BZQ